program: Orca
programVersion: 5.0.2
elementType: O O N N C C C C C C C C C C C C H H H H H H H H H H H H
charge: 0
multiplicity: 1
keywords: wb97x-d3
keywords: def2-TZVPP
keywords: def2/J RIJCOSX
keywords: DEFGRID2
keywords: scfconv7
keywords: smallprint printgap noloewdin
keywords: NOSOSCF
formula: C12H12N2O2
InChI: InChI=1/C12H12N2O2/c1-2-16-12(15)10(8-13)11(14)9-6-4-3-5-7-9/h3-7H,2,14H2,1H3
28 atoms
O  2.635231 -0.560782 0.081429
O  2.712642 1.583409 -0.550917
N  0.224121 -1.655534 0.636652
N  -0.417171 2.876228 -0.681732
C  -1.670874 -0.32589 0.155968
C  -0.199062 -0.482964 0.20801
C  -2.30201 0.019677 -1.036033
C  -2.428965 -0.557709 1.301314
C  0.619536 0.581992 -0.165148
C  -3.682709 0.134201 -1.078347
C  -3.808663 -0.426926 1.256146
C  -4.436737 -0.083932 0.066995
C  2.073495 0.59843 -0.234202
C  4.070875 -0.66104 0.064198
C  4.435811 -2.033935 0.566561
C  0.027659 1.831201 -0.458655
H  -1.719466 0.180773 -1.933867
H  -1.943527 -0.821037 2.232428
H  -4.169834 0.391736 -2.009102
H  -4.392084 -0.594659 2.151361
H  -5.51388 0.011538 0.032101
H  4.431698 -0.505804 -0.954026
H  4.499874 0.113225 0.701899
H  1.20491 -1.861226 0.748548
H  -0.440649 -2.386272 0.837554
H  4.027803 -2.819921 -0.068672
H  5.520897 -2.1344 0.564975
H  4.088488 -2.192564 1.587655
elementType: O N C H
totalener: -724.53809721 hartree
nucrepener: 1023.84449416 hartree
electener: -1748.38259137 hartree
oneelecener: -3015.09433756 hartree
twoeener: 1266.71174619 hartree
cpcmener: -0.05197103 hartree
kineticenergy: 721.41658446 hartree
xcener: -69.496511426405 hartree
chargesum: -0.0000000
charge: -0.300602 -0.519627 -0.187795 -0.153748 0.067005 0.287496 -0.253707 -0.201940 -0.027100 -0.135746 -0.160309 -0.142538 0.470148 0.032449 -0.262128 -0.219591 0.165331 0.156419 0.163134 0.161874 0.163545 0.103400 0.098068 0.210995 0.205994 0.090706 0.098960 0.089308
qa: -0.3006 -0.5196 -0.1878 -0.1537 0.0670 0.2875 -0.2537 -0.2019 -0.0271 -0.1357 -0.1603 -0.1425 0.4701 0.0324 -0.2621 -0.2196 0.1653 0.1564 0.1631 0.1619 0.1635 0.1034 0.0981 0.2110 0.2060 0.0907 0.0990 0.0893
va: 2.1077 1.9905 3.3954 3.1366 3.5002 3.8729 3.9556 3.9708 3.4138 3.8924 3.9087 3.9022 4.2245 3.8424 3.9606 4.1581 0.9989 1.0075 0.9902 0.9914 0.9883 0.9940 0.9972 1.0117 0.9905 1.0024 1.0068 1.0026
dispcorr: -0.011192841 hartree
energy: -724.549290050955
dipole: 5.28484 -5.75575 -0.47091 -12.01736 6.95077 -5.06659 3.45773 -1.96367 1.49406
magnitude: 5.30323 au
magnitude: 13.47975 debye
