program: Orca
programVersion: 5.0.2
elementType: Cl O N N C C C C C C C C C C C C C C C C C C C H H H H H H H H H H H H H H H H H H H H H
charge: 0
multiplicity: 1
keywords: wb97x-d3
keywords: def2-TZVPP
keywords: def2/J RIJCOSX
keywords: DEFGRID2
keywords: scfconv7
keywords: smallprint printgap noloewdin
keywords: NOSOSCF
formula: C19H21ClN2O
InChI: InChI=1/C19H21ClN2O/c20-16-12-10-15(11-13-16)14-22(18-8-4-5-9-18)19(23)21-17-6-2-1-3-7-17/h1-3,6-7,10-13,18,21H,4-5,8-9,14H2
44 atoms
Cl 0.999878 5.314077 -0.847226
O  -0.622031 -2.847909 -0.440577
N  -1.280669 -0.958122 0.628552
N  0.965237 -1.520373 0.503204
C  -2.657714 -1.177718 0.171096
C  -2.913944 -0.958667 -1.322826
C  -3.705592 -0.265067 0.804501
C  -4.440958 -0.997958 -1.422079
C  -4.957011 -0.52493 -0.042798
C  -0.950467 0.128693 1.525971
C  -0.334968 -1.833319 0.189303
C  -0.467428 1.409878 0.883466
C  -0.311471 1.562849 -0.487294
C  -0.150285 2.485015 1.712363
C  2.086489 -2.289123 0.168137
C  0.136481 2.762189 -1.027828
C  0.300317 3.685628 1.192125
C  0.438217 3.814303 -0.182835
C  3.258568 -1.610993 -0.16927
C  2.102496 -3.68269 0.225697
C  4.421138 -2.309494 -0.452457
C  3.268694 -4.372062 -0.075337
C  4.432656 -3.697151 -0.416564
H  -2.931722 -2.209436 0.415562
H  -2.432335 -1.695905 -1.962932
H  -2.539731 0.026323 -1.612238
H  -3.404203 0.781056 0.702883
H  -3.868795 -0.462464 1.864761
H  -4.780621 -2.014945 -1.624686
H  -4.807706 -0.376604 -2.239116
H  -5.572268 0.371509 -0.116638
H  -5.577416 -1.294197 0.418771
H  -0.206556 -0.212988 2.249982
H  -1.824041 0.352156 2.135336
H  1.183357 -0.562397 0.731907
H  -0.534873 0.747455 -1.162205
H  -0.256846 2.385623 2.786295
H  0.248296 2.862871 -2.098905
H  0.540388 4.508805 1.851288
H  3.256255 -0.527718 -0.209149
H  1.224554 -4.236448 0.522726
H  5.318839 -1.762104 -0.709355
H  3.264685 -5.453405 -0.027849
H  5.337472 -4.244766 -0.643965
elementType: Cl O N C H
totalener: -1381.72642816 hartree
nucrepener: 1993.45005691 hartree
electener: -3375.17648507 hartree
oneelecener: -5846.41760654 hartree
twoeener: 2471.24112147 hartree
cpcmener: -0.03742649 hartree
kineticenergy: 1376.84624287 hartree
xcener: -112.745408731765 hartree
chargesum: -0.0000000
charge: -0.102940 -0.590764 -0.134842 -0.200082 0.063211 -0.177165 -0.166543 -0.147290 -0.152357 -0.050998 0.454497 0.020881 -0.197422 -0.231045 0.205506 -0.172796 -0.147847 0.110295 -0.235938 -0.242316 -0.133422 -0.140389 -0.193886 0.081442 0.085742 0.085433 0.089525 0.092949 0.081203 0.075256 0.075143 0.081160 0.128763 0.136910 0.186347 0.165916 0.144676 0.142101 0.144210 0.142385 0.144359 0.159922 0.159532 0.160679
qa: -0.1029 -0.5908 -0.1348 -0.2001 0.0632 -0.1772 -0.1665 -0.1473 -0.1524 -0.0510 0.4545 0.0209 -0.1974 -0.2310 0.2055 -0.1728 -0.1478 0.1103 -0.2359 -0.2423 -0.1334 -0.1404 -0.1939 0.0814 0.0857 0.0854 0.0895 0.0929 0.0812 0.0753 0.0751 0.0812 0.1288 0.1369 0.1863 0.1659 0.1447 0.1421 0.1442 0.1424 0.1444 0.1599 0.1595 0.1607
va: 1.2013 1.9095 3.1274 3.2112 3.7682 3.9076 3.9429 3.9246 3.9149 3.8281 4.2044 3.4444 3.9344 4.0333 3.6946 4.0633 3.9793 3.7977 3.9603 3.9857 3.8952 3.9086 3.9003 1.0243 1.0301 1.0094 1.0036 1.0090 1.0073 1.0095 1.0090 1.0071 1.0028 0.9846 1.0005 0.9906 1.0016 1.0086 1.0056 1.0070 1.0252 0.9898 0.9909 0.9897
dispcorr: -0.022091911 hartree
energy: -1381.748520068340
dipole: -18.42588 17.99993 -0.42595 -19.42710 20.80511 1.37801 2.59098 -0.98569 1.60529
magnitude: 2.15807 au
magnitude: 5.48539 debye
