program: Orca
programVersion: 5.0.2
elementType: Cl O N N C C C C C C C C C C C C C C C C C C C H H H H H H H H H H H H H H H H H H H H H
charge: 0
multiplicity: 1
keywords: wb97x-d3
keywords: def2-TZVPP
keywords: def2/J RIJCOSX
keywords: DEFGRID2
keywords: scfconv7
keywords: smallprint printgap noloewdin
keywords: NOSOSCF
formula: C19H21ClN2O
InChI: InChI=1/C19H21ClN2O/c20-16-12-10-15(11-13-16)14-22(18-8-4-5-9-18)19(23)21-17-6-2-1-3-7-17/h1-3,6-7,10-13,18,21H,4-5,8-9,14H2
44 atoms
Cl 0.347166 5.340197 1.493279
O  -0.534164 -2.856639 0.258706
N  -1.045763 -0.933209 -0.824454
N  1.15996 -1.661905 -0.667863
C  -2.435003 -1.06824 -0.379317
C  -3.465594 -0.257232 -1.161448
C  -2.71258 -0.66137 1.074588
C  -4.72371 -0.482461 -0.329451
C  -4.237123 -0.439839 1.133053
C  -0.660039 0.248687 -1.567964
C  -0.162897 -1.868124 -0.368945
C  -0.426564 1.499654 -0.753709
C  -0.735582 2.732884 -1.31925
C  0.12116 1.476373 0.52469
C  2.243167 -2.491162 -0.364201
C  -0.498067 3.917993 -0.641057
C  0.361027 2.652057 1.22096
C  0.051661 3.865942 0.629173
C  2.155339 -3.857402 -0.095491
C  3.507213 -1.892905 -0.389674
C  3.311841 -4.585327 0.155857
C  4.650582 -2.631556 -0.14605
C  4.562689 -3.988327 0.136222
H  -2.710174 -2.118613 -0.500333
H  -3.571059 -0.578855 -2.198522
H  -3.214632 0.807164 -1.158455
H  -2.184539 0.266025 1.30126
H  -2.367924 -1.411611 1.785145
H  -5.144825 -1.462819 -0.561394
H  -5.497476 0.256201 -0.537637
H  -4.463921 0.524274 1.5888
H  -4.736114 -1.197265 1.737204
H  -1.430079 0.451954 -2.310636
H  0.222357 0.036145 -2.174876
H  1.44056 -0.754838 -1.004092
H  -1.174527 2.774197 -2.308643
H  0.361268 0.539569 1.01053
H  -0.746907 4.865419 -1.098769
H  0.783929 2.615004 2.215535
H  1.207887 -4.369947 -0.088604
H  3.591215 -0.833898 -0.606138
H  3.222391 -5.643734 0.363662
H  5.613188 -2.138423 -0.176646
H  5.454134 -4.568538 0.331923
elementType: Cl O N C H
totalener: -1381.72644339 hartree
nucrepener: 1991.42378804 hartree
electener: -3373.15023142 hartree
oneelecener: -5842.28317030 hartree
twoeener: 2469.13293888 hartree
cpcmener: -0.03750369 hartree
kineticenergy: 1376.85581439 hartree
xcener: -112.748656375740 hartree
chargesum: 0.0000000
charge: -0.102860 -0.591052 -0.133098 -0.181088 0.052384 -0.146940 -0.189145 -0.152240 -0.135544 -0.017915 0.444510 0.080633 -0.248305 -0.251276 0.222955 -0.143106 -0.140777 0.096938 -0.250850 -0.252593 -0.140517 -0.124541 -0.207166 0.078055 0.088259 0.082067 0.094878 0.083694 0.080809 0.076759 0.075719 0.075328 0.131290 0.113164 0.175981 0.145318 0.153762 0.144488 0.142962 0.150251 0.139583 0.158944 0.159765 0.160521
qa: -0.1029 -0.5911 -0.1331 -0.1811 0.0524 -0.1469 -0.1891 -0.1522 -0.1355 -0.0179 0.4445 0.0806 -0.2483 -0.2513 0.2230 -0.1431 -0.1408 0.0969 -0.2509 -0.2526 -0.1405 -0.1245 -0.2072 0.0781 0.0883 0.0821 0.0949 0.0837 0.0808 0.0768 0.0757 0.0753 0.1313 0.1132 0.1760 0.1453 0.1538 0.1445 0.1430 0.1503 0.1396 0.1589 0.1598 0.1605
va: 1.2013 1.9055 3.1294 3.2420 3.8095 3.9211 3.9015 3.9351 3.9036 3.8362 4.2092 3.4610 4.0405 3.9608 3.7356 3.9803 4.0329 3.8198 3.9654 3.9509 3.9103 3.8882 3.9072 1.0277 1.0117 1.0091 1.0068 1.0267 1.0079 1.0112 1.0073 1.0098 0.9841 1.0022 1.0072 1.0030 1.0013 1.0053 1.0078 1.0330 1.0090 0.9910 0.9896 0.9901
dispcorr: -0.022258749 hartree
energy: -1381.748702134562
dipole: -14.91417 14.81197 -0.10220 -18.49466 19.95468 1.46002 -6.12894 4.40549 -1.72345
magnitude: 2.26106 au
magnitude: 5.74716 debye
