program: Orca
programVersion: 5.0.2
elementType: Cl O N N C C C C C C C C C C C C C C C C C C C H H H H H H H H H H H H H H H H H H H H H
charge: 0
multiplicity: 1
keywords: wb97x-d3
keywords: def2-TZVPP
keywords: def2/J RIJCOSX
keywords: DEFGRID2
keywords: scfconv7
keywords: smallprint printgap noloewdin
keywords: NOSOSCF
formula: C19H21ClN2O
InChI: InChI=1/C19H21ClN2O/c20-16-12-10-15(11-13-16)14-22(18-8-4-5-9-18)19(23)21-17-6-2-1-3-7-17/h1-3,6-7,10-13,18,21H,4-5,8-9,14H2
44 atoms
Cl 0.828529 5.119372 1.504232
O  -0.678442 -2.964223 -0.02912
N  -1.237662 -0.933645 -0.865666
N  0.984731 -1.507952 -0.57855
C  -2.654739 -1.196246 -0.574992
C  -3.595004 -0.060025 -0.98533
C  -2.981395 -1.442214 0.921073
C  -4.852116 -0.358484 -0.182009
C  -4.29406 -0.689636 1.19945
C  -0.834023 0.239096 -1.613386
C  -0.333654 -1.868984 -0.4655
C  -0.410803 1.43593 -0.791416
C  0.096736 2.552333 -1.453418
C  -0.517961 1.476761 0.592161
C  2.110893 -2.274745 -0.269045
C  0.477529 3.687271 -0.758841
C  -0.140936 2.607454 1.305894
C  0.353404 3.704065 0.623039
C  2.142398 -3.670054 -0.252867
C  3.292539 -1.572383 -0.013756
C  3.331544 -4.32938 0.030493
C  4.472242 -2.242705 0.257798
C  4.501054 -3.630566 0.288622
H  -2.95882 -2.083165 -1.138952
H  -3.768963 -0.016366 -2.060896
H  -3.197895 0.908088 -0.667572
H  -2.177929 -1.088511 1.56797
H  -3.094615 -2.507142 1.114917
H  -5.374579 -1.220752 -0.604597
H  -5.552975 0.476549 -0.174307
H  -4.090185 0.237315 1.739449
H  -4.986768 -1.268744 1.810355
H  -1.656015 0.534768 -2.26372
H  -0.033592 -0.026666 -2.308231
H  1.193389 -0.530691 -0.719118
H  0.195935 2.539172 -2.53236
H  -0.897654 0.623738 1.139054
H  0.867915 4.545315 -1.288977
H  -0.23328 2.622747 2.383374
H  1.262535 -4.251609 -0.473803
H  3.282899 -0.488481 -0.028701
H  3.336744 -5.41173 0.037852
H  5.371898 -1.672972 0.450891
H  5.420708 -4.157301 0.505279
elementType: Cl O N C H
totalener: -1381.72594529 hartree
nucrepener: 2000.59144826 hartree
electener: -3382.31739355 hartree
oneelecener: -5860.59385334 hartree
twoeener: 2478.27645979 hartree
cpcmener: -0.03714190 hartree
kineticenergy: 1376.85515785 hartree
xcener: -112.747407568285 hartree
chargesum: -0.0000000
charge: -0.102734 -0.586108 -0.131020 -0.186933 0.015757 -0.155380 -0.177584 -0.141886 -0.127826 -0.046505 0.446534 0.003196 -0.234869 -0.195113 0.220278 -0.148090 -0.164058 0.109699 -0.250416 -0.251163 -0.139504 -0.128778 -0.204968 0.096598 0.092193 0.091953 0.082954 0.085155 0.076038 0.075019 0.074334 0.074829 0.140161 0.129538 0.187754 0.144195 0.171466 0.144433 0.142314 0.149022 0.139854 0.159417 0.159770 0.160472
qa: -0.1027 -0.5861 -0.1310 -0.1869 0.0158 -0.1554 -0.1776 -0.1419 -0.1278 -0.0465 0.4465 0.0032 -0.2349 -0.1951 0.2203 -0.1481 -0.1641 0.1097 -0.2504 -0.2512 -0.1395 -0.1288 -0.2050 0.0966 0.0922 0.0920 0.0830 0.0852 0.0760 0.0750 0.0743 0.0748 0.1402 0.1295 0.1878 0.1442 0.1715 0.1444 0.1423 0.1490 0.1399 0.1594 0.1598 0.1605
va: 1.2015 1.9154 3.1027 3.2317 3.7779 3.9263 3.8751 3.9415 3.9051 3.8003 4.2166 3.4629 4.0428 3.8947 3.7300 3.9701 4.0529 3.7991 3.9644 3.9512 3.9086 3.8919 3.9056 1.0149 1.0118 1.0050 1.0110 1.0195 1.0099 1.0144 1.0095 1.0129 0.9832 1.0031 0.9978 1.0016 0.9928 1.0056 1.0086 1.0318 1.0083 0.9908 0.9896 0.9900
dispcorr: -0.022386556 hartree
energy: -1381.748331846238
dipole: -17.14211 16.79881 -0.34330 -18.17727 19.79752 1.62025 -5.51055 4.05913 -1.45141
magnitude: 2.20219 au
magnitude: 5.59753 debye
