program: Orca
programVersion: 5.0.2
elementType: Cl O N N C C C C C C C C C C C C C C C C C C C H H H H H H H H H H H H H H H H H H H H H
charge: 0
multiplicity: 1
keywords: wb97x-d3
keywords: def2-TZVPP
keywords: def2/J RIJCOSX
keywords: DEFGRID2
keywords: scfconv7
keywords: smallprint printgap noloewdin
keywords: NOSOSCF
formula: C19H21ClN2O
InChI: InChI=1/C19H21ClN2O/c20-16-12-10-15(11-13-16)14-22(18-8-4-5-9-18)19(23)21-17-6-2-1-3-7-17/h1-3,6-7,10-13,18,21H,4-5,8-9,14H2
44 atoms
Cl -0.517239 5.815836 1.289239
O  1.605116 -0.792835 -1.729135
N  -0.576698 -0.399184 -1.229152
N  0.570674 -2.15688 -0.242606
C  -1.777437 -0.571216 -0.409211
C  -1.630852 -0.236065 1.087949
C  -2.4866 -1.955249 -0.473435
C  -2.753127 -1.033262 1.744605
C  -2.739203 -2.359556 0.98464
C  -0.572549 0.805247 -2.048698
C  0.592119 -1.090656 -1.097605
C  -0.543099 2.070078 -1.22858
C  0.532363 2.355881 -0.390114
C  -1.605705 2.964327 -1.274397
C  1.592863 -3.055685 0.071344
C  0.546907 3.503601 0.385274
C  -1.60786 4.122159 -0.507713
C  -0.528033 4.378707 0.318874
C  1.289052 -3.995514 1.063596
C  2.855246 -3.096941 -0.523247
C  2.215039 -4.944431 1.454444
C  3.775665 -4.056262 -0.118341
C  3.472777 -4.983351 0.865845
H  -2.48161 0.150235 -0.821079
H  -1.70097 0.837582 1.264389
H  -0.663923 -0.557986 1.481844
H  -1.927529 -2.704079 -1.034853
H  -3.434919 -1.836139 -0.997539
H  -3.710157 -0.526277 1.594843
H  -2.613208 -1.154859 2.819046
H  -1.928853 -2.990626 1.364327
H  -3.659075 -2.93184 1.104177
H  -1.469452 0.798532 -2.669984
H  0.274859 0.776335 -2.728809
H  -0.27412 -2.332882 0.274272
H  1.376703 1.679821 -0.335601
H  -2.453345 2.758118 -1.916732
H  1.387587 3.713366 1.032632
H  -2.444299 4.806269 -0.555577
H  0.311704 -3.979095 1.533214
H  3.133515 -2.400459 -1.295343
H  1.948065 -5.656245 2.224525
H  4.748502 -4.071526 -0.592748
H  4.20035 -5.723953 1.169069
elementType: Cl O N C H
totalener: -1381.72570844 hartree
nucrepener: 2002.82801761 hartree
electener: -3384.55372606 hartree
oneelecener: -5865.14324735 hartree
twoeener: 2480.58952130 hartree
cpcmener: -0.03420896 hartree
kineticenergy: 1376.85184248 hartree
xcener: -112.746059152480 hartree
chargesum: -0.0000000
charge: -0.103072 -0.600524 -0.147679 -0.197050 0.069769 -0.170625 -0.210827 -0.125871 -0.134726 -0.021269 0.442447 0.052849 -0.208959 -0.213531 0.244025 -0.153903 -0.142051 0.095074 -0.267190 -0.266939 -0.145532 -0.138844 -0.202572 0.092322 0.076963 0.085431 0.086388 0.094350 0.077495 0.075088 0.071391 0.084120 0.118070 0.120283 0.192410 0.143246 0.144606 0.144121 0.145117 0.162483 0.155746 0.158399 0.159237 0.159729
qa: -0.1031 -0.6005 -0.1477 -0.1971 0.0698 -0.1706 -0.2108 -0.1259 -0.1347 -0.0213 0.4424 0.0528 -0.2090 -0.2135 0.2440 -0.1539 -0.1421 0.0951 -0.2672 -0.2669 -0.1455 -0.1388 -0.2026 0.0923 0.0770 0.0854 0.0864 0.0944 0.0775 0.0751 0.0714 0.0841 0.1181 0.1203 0.1924 0.1432 0.1446 0.1441 0.1451 0.1625 0.1557 0.1584 0.1592 0.1597
va: 1.2007 1.8920 3.1282 3.2385 3.7897 3.9010 3.8769 3.9317 3.9153 3.8025 4.2183 3.4950 3.9424 3.9891 3.7675 4.0131 3.9828 3.8178 3.9333 3.9654 3.9093 3.9051 3.9028 0.9973 1.0157 1.0171 1.0195 0.9997 1.0080 1.0133 1.0155 1.0130 0.9991 1.0283 1.0059 1.0207 1.0031 1.0059 1.0042 0.9985 1.0396 0.9918 0.9911 0.9902
dispcorr: -0.023226369 hartree
energy: -1381.748934811596
dipole: -10.14454 7.60321 -2.54134 -27.96546 27.02258 -0.94288 1.01302 -0.31285 0.70017
magnitude: 2.79958 au
magnitude: 7.11597 debye
