program: Orca
programVersion: 5.0.2
elementType: Cl O N N C C C C C C C C C C C C C C C C C C C H H H H H H H H H H H H H H H H H H H H H
charge: 0
multiplicity: 1
keywords: wb97x-d3
keywords: def2-TZVPP
keywords: def2/J RIJCOSX
keywords: DEFGRID2
keywords: scfconv7
keywords: smallprint printgap noloewdin
keywords: NOSOSCF
formula: C19H21ClN2O
InChI: InChI=1/C19H21ClN2O/c20-16-12-10-15(11-13-16)14-22(18-8-4-5-9-18)19(23)21-17-6-2-1-3-7-17/h1-3,6-7,10-13,18,21H,4-5,8-9,14H2
44 atoms
Cl 1.432553 5.572038 -0.275384
O  0.707523 -0.549964 1.369808
N  -1.240951 -0.640103 0.228798
N  0.487248 -2.108292 -0.274852
C  -2.291805 -1.440419 -0.392909
C  -3.121355 -0.678541 -1.459955
C  -3.320382 -2.001777 0.608206
C  -4.584963 -0.824254 -1.032269
C  -4.601091 -2.111534 -0.209884
C  -1.659097 0.549546 0.948845
C  0.024676 -1.079143 0.503598
C  -0.852039 1.780895 0.624026
C  -0.410756 2.054423 -0.666688
C  -0.571377 2.700488 1.628093
C  1.734958 -2.730435 -0.221219
C  0.293293 3.215355 -0.950747
C  0.124183 3.869942 1.362546
C  0.552891 4.117372 0.069008
C  2.604705 -2.687433 0.870355
C  2.10415 -3.47757 -1.345092
C  3.817192 -3.362226 0.810703
C  3.312393 -4.149708 -1.386819
C  4.185635 -4.092641 -0.308843
H  -1.83386 -2.295996 -0.882285
H  -2.962227 -1.140131 -2.436015
H  -2.813856 0.363354 -1.559357
H  -3.475509 -1.302314 1.433867
H  -2.988852 -2.945843 1.042922
H  -5.273664 -0.842593 -1.877702
H  -4.878169 0.015318 -0.395578
H  -5.493702 -2.218436 0.407944
H  -4.556438 -2.981543 -0.871725
H  -1.656675 0.389481 2.030483
H  -2.698906 0.743863 0.68051
H  -0.029256 -2.321934 -1.112773
H  -0.602679 1.353314 -1.469428
H  -0.894699 2.501924 2.643028
H  0.634799 3.410806 -1.958716
H  0.335328 4.571187 2.158735
H  2.350959 -2.140253 1.763535
H  1.435077 -3.528826 -2.196897
H  4.48143 -3.312622 1.664365
H  3.570983 -4.718119 -2.271163
H  5.134622 -4.611225 -0.341157
elementType: Cl O N C H
totalener: -1381.73918420 hartree
nucrepener: 1975.00993469 hartree
electener: -3356.74911890 hartree
oneelecener: -5810.18559343 hartree
twoeener: 2453.43647453 hartree
cpcmener: -0.03382398 hartree
kineticenergy: 1376.85780016 hartree
xcener: -112.742909633408 hartree
chargesum: -0.0000000
charge: -0.104779 -0.540106 -0.137981 -0.174644 0.036565 -0.183343 -0.161607 -0.145112 -0.124571 -0.033780 0.431828 0.105977 -0.226244 -0.252132 0.214744 -0.161326 -0.134147 0.088209 -0.242450 -0.247858 -0.136155 -0.123546 -0.205016 0.085657 0.092586 0.087084 0.084254 0.079270 0.078720 0.074679 0.075036 0.074548 0.116769 0.126915 0.166569 0.143738 0.136488 0.140518 0.140607 0.151254 0.135229 0.155342 0.156059 0.156154
qa: -0.1048 -0.5401 -0.1380 -0.1746 0.0366 -0.1833 -0.1616 -0.1451 -0.1246 -0.0338 0.4318 0.1060 -0.2262 -0.2521 0.2147 -0.1613 -0.1341 0.0882 -0.2424 -0.2479 -0.1362 -0.1235 -0.2050 0.0857 0.0926 0.0871 0.0843 0.0793 0.0787 0.0747 0.0750 0.0745 0.1168 0.1269 0.1666 0.1437 0.1365 0.1405 0.1406 0.1513 0.1352 0.1553 0.1561 0.1562
va: 1.1994 1.9622 3.0379 3.2355 3.8359 3.8830 3.9010 3.9238 3.8962 3.8179 4.2279 3.4572 3.9863 4.0784 3.7728 4.0288 3.9744 3.8246 3.9601 3.9441 3.9110 3.9006 3.9149 1.0147 1.0021 1.0122 1.0131 1.0178 1.0147 1.0084 1.0149 1.0090 1.0085 0.9860 1.0153 1.0100 1.0074 1.0073 1.0061 1.0331 1.0097 0.9921 0.9907 0.9915
dispcorr: -0.021244186 hartree
energy: -1381.760428390261
dipole: -22.60308 20.16491 -2.43817 -27.48128 25.86198 -1.61930 -3.01322 1.73649 -1.27672
magnitude: 3.19325 au
magnitude: 8.11659 debye
