program: Orca
programVersion: 5.0.2
elementType: Cl O N N C C C C C C C C C C C C C C C C C C C H H H H H H H H H H H H H H H H H H H H H
charge: 0
multiplicity: 1
keywords: wb97x-d3
keywords: def2-TZVPP
keywords: def2/J RIJCOSX
keywords: DEFGRID2
keywords: scfconv7
keywords: smallprint printgap noloewdin
keywords: NOSOSCF
formula: C19H21ClN2O
InChI: InChI=1/C19H21ClN2O/c20-16-12-10-15(11-13-16)14-22(18-8-4-5-9-18)19(23)21-17-6-2-1-3-7-17/h1-3,6-7,10-13,18,21H,4-5,8-9,14H2
44 atoms
Cl 1.233456 5.151005 -0.738099
O  -0.693853 -2.862247 -0.431644
N  -1.408503 -0.965459 0.580005
N  0.853686 -1.430565 0.428081
C  -2.787608 -1.304873 0.202339
C  -3.035754 -1.365637 -1.327922
C  -3.84653 -0.327995 0.719806
C  -4.407746 -0.70825 -1.564476
C  -5.041077 -0.622817 -0.177503
C  -1.110168 0.085159 1.534809
C  -0.43427 -1.819587 0.155555
C  -0.515122 1.341244 0.938175
C  0.346234 2.125089 1.700615
C  -0.816162 1.75168 -0.3559
C  2.030714 -2.124849 0.141374
C  0.886863 3.298311 1.195849
C  -0.284436 2.921543 -0.87698
C  0.562299 3.68877 -0.093065
C  3.211457 -1.374626 0.128538
C  2.109533 -3.501005 -0.084834
C  4.434525 -1.976923 -0.109136
C  3.343379 -4.089557 -0.328939
C  4.511817 -3.342899 -0.34636
H  -3.024471 -2.286195 0.62559
H  -3.030841 -2.398078 -1.673132
H  -2.246767 -0.847495 -1.875559
H  -3.536823 0.710065 0.562718
H  -4.063719 -0.456464 1.781603
H  -5.019821 -1.262205 -2.277341
H  -4.283083 0.298676 -1.969444
H  -5.818365 0.139001 -0.104988
H  -5.494929 -1.578517 0.09962
H  -0.447148 -0.296679 2.316528
H  -2.026912 0.347827 2.059445
H  1.009251 -0.466622 0.68284
H  0.609058 1.818109 2.706391
H  -1.468479 1.154105 -0.979864
H  1.557934 3.892604 1.801566
H  -0.529532 3.224779 -1.886025
H  3.16893 -0.305805 0.307594
H  1.22885 -4.121924 -0.067914
H  5.331273 -1.370133 -0.11081
H  3.382011 -5.157432 -0.504825
H  5.465781 -3.816526 -0.537799
elementType: Cl O N C H
totalener: -1381.73826008 hartree
nucrepener: 2001.96107465 hartree
electener: -3383.69933473 hartree
oneelecener: -5863.31203433 hartree
twoeener: 2479.61269960 hartree
cpcmener: -0.02935694 hartree
kineticenergy: 1376.83776616 hartree
xcener: -112.741559684378 hartree
chargesum: 0.0000000
charge: -0.097891 -0.548094 -0.128863 -0.197973 0.031888 -0.182390 -0.161970 -0.132550 -0.140531 -0.067641 0.427792 0.028009 -0.231349 -0.184245 0.226296 -0.140650 -0.175934 0.116157 -0.250003 -0.244848 -0.132505 -0.134939 -0.201694 0.090950 0.089081 0.080176 0.089804 0.091978 0.076522 0.074639 0.074378 0.076960 0.130118 0.133003 0.186577 0.140100 0.157709 0.141425 0.138920 0.135355 0.149359 0.155126 0.154975 0.156771
qa: -0.0979 -0.5481 -0.1289 -0.1980 0.0319 -0.1824 -0.1620 -0.1325 -0.1405 -0.0676 0.4278 0.0280 -0.2313 -0.1842 0.2263 -0.1407 -0.1759 0.1162 -0.2500 -0.2448 -0.1325 -0.1349 -0.2017 0.0909 0.0891 0.0802 0.0898 0.0920 0.0765 0.0746 0.0744 0.0770 0.1301 0.1330 0.1866 0.1401 0.1577 0.1414 0.1389 0.1354 0.1494 0.1551 0.1550 0.1568
va: 1.2061 1.9600 3.0917 3.2218 3.7680 3.8748 3.9243 3.9020 3.9337 3.8090 4.2394 3.4997 4.0330 3.9511 3.7478 3.9738 4.0638 3.8092 3.9489 3.9612 3.9066 3.9121 3.9119 1.0185 1.0201 1.0087 1.0031 1.0111 1.0130 1.0079 1.0143 1.0095 1.0060 0.9865 1.0063 1.0040 0.9922 1.0064 1.0099 1.0093 1.0342 0.9912 0.9921 0.9910
dispcorr: -0.022378842 hartree
energy: -1381.760638925018
dipole: -19.45745 18.76682 -0.69063 -19.07752 20.40206 1.32453 1.91769 -0.45125 1.46644
magnitude: 2.09328 au
magnitude: 5.32069 debye
