program: Orca
programVersion: 5.0.2
elementType: Cl O N N C C C C C C C C C C C C C C C C C C C H H H H H H H H H H H H H H H H H H H H H
charge: 0
multiplicity: 1
keywords: wb97x-d3
keywords: def2-TZVPP
keywords: def2/J RIJCOSX
keywords: DEFGRID2
keywords: scfconv7
keywords: smallprint printgap noloewdin
keywords: NOSOSCF
formula: C19H21ClN2O
InChI: InChI=1/C19H21ClN2O/c20-16-12-10-15(11-13-16)14-22(18-8-4-5-9-18)19(23)21-17-6-2-1-3-7-17/h1-3,6-7,10-13,18,21H,4-5,8-9,14H2
44 atoms
Cl 0.083131 6.080025 -0.657566
O  1.536529 -0.75926 1.304007
N  -0.605215 -0.570078 0.598824
N  0.671762 -2.422053 0.018169
C  -1.725244 -1.006806 -0.225705
C  -2.569434 0.109764 -0.843337
C  -2.754722 -1.887904 0.505899
C  -3.775836 -0.664619 -1.360911
C  -4.084285 -1.67727 -0.24475
C  -0.829109 0.531943 1.512272
C  0.589166 -1.223622 0.679746
C  -0.592211 1.904928 0.931394
C  -1.380449 2.968962 1.359023
C  0.410547 2.157715 0.001231
C  1.805408 -3.21931 -0.154927
C  -1.181095 4.255221 0.881575
C  0.622891 3.437634 -0.490742
C  -0.175401 4.478105 -0.04461
C  3.121601 -2.775007 -0.009637
C  1.585983 -4.544891 -0.542883
C  4.17469 -3.650143 -0.239329
C  2.646296 -5.403591 -0.774797
C  3.954327 -4.965027 -0.620126
H  -1.318406 -1.558627 -1.075969
H  -2.036754 0.660746 -1.619596
H  -2.894329 0.828431 -0.087307
H  -2.839376 -1.565588 1.545937
H  -2.441941 -2.933435 0.528193
H  -3.513167 -1.184398 -2.28597
H  -4.623648 -0.017675 -1.588409
H  -4.838348 -1.272866 0.431982
H  -4.489412 -2.607407 -0.643454
H  -0.194631 0.402277 2.38964
H  -1.854823 0.474896 1.883678
H  -0.185649 -2.868975 -0.26657
H  -2.175674 2.795113 2.07471
H  1.04441 1.358724 -0.35941
H  -1.809557 5.066641 1.223857
H  1.406668 3.615077 -1.215099
H  3.340454 -1.759002 0.275097
H  0.571216 -4.90706 -0.665709
H  5.186925 -3.28536 -0.117754
H  2.443895 -6.423485 -1.076407
H  4.785231 -5.635282 -0.796348
elementType: Cl O N C H
totalener: -1381.74159678 hartree
nucrepener: 1968.12326564 hartree
electener: -3349.86486242 hartree
oneelecener: -5795.93588138 hartree
twoeener: 2446.07101896 hartree
cpcmener: -0.03145447 hartree
kineticenergy: 1376.84683209 hartree
xcener: -112.743922365346 hartree
chargesum: -0.0000000
charge: -0.103471 -0.556886 -0.111015 -0.186851 -0.032693 -0.117929 -0.169313 -0.152446 -0.123291 -0.000305 0.437432 0.040923 -0.223926 -0.213492 0.218632 -0.147206 -0.149092 0.100421 -0.242915 -0.253787 -0.135055 -0.123286 -0.203904 0.082123 0.083025 0.082477 0.081340 0.078683 0.081214 0.078131 0.077400 0.073399 0.110226 0.119901 0.176243 0.140591 0.150381 0.141791 0.139476 0.150145 0.135929 0.155483 0.155161 0.156335
qa: -0.1035 -0.5569 -0.1110 -0.1869 -0.0327 -0.1179 -0.1693 -0.1524 -0.1233 -0.0003 0.4374 0.0409 -0.2239 -0.2135 0.2186 -0.1472 -0.1491 0.1004 -0.2429 -0.2538 -0.1351 -0.1233 -0.2039 0.0821 0.0830 0.0825 0.0813 0.0787 0.0812 0.0781 0.0774 0.0734 0.1102 0.1199 0.1762 0.1406 0.1504 0.1418 0.1395 0.1501 0.1359 0.1555 0.1552 0.1563
va: 1.2006 1.9383 3.0946 3.2545 3.9249 3.8907 3.8910 3.9545 3.8790 3.8055 4.2232 3.5443 4.0131 3.9595 3.7641 3.9882 4.0348 3.8152 3.9602 3.9514 3.9147 3.9000 3.9153 1.0189 1.0176 1.0121 1.0125 1.0154 1.0073 1.0123 1.0078 1.0111 1.0207 0.9887 1.0065 1.0028 1.0063 1.0058 1.0084 1.0320 1.0094 0.9921 0.9910 0.9913
dispcorr: -0.021598531 hartree
energy: -1381.763195306004
dipole: -16.06884 13.55291 -2.51593 -28.07102 26.53133 -1.53969 -0.92956 0.33647 -0.59309
magnitude: 3.00871 au
magnitude: 7.64753 debye
