program: Orca
programVersion: 5.0.2
elementType: Cl O N N C C C C C C C C C C C C C C C C C C C H H H H H H H H H H H H H H H H H H H H H
charge: 0
multiplicity: 1
keywords: wb97x-d3
keywords: def2-TZVPP
keywords: def2/J RIJCOSX
keywords: DEFGRID2
keywords: scfconv7
keywords: smallprint printgap noloewdin
keywords: NOSOSCF
formula: C19H21ClN2O
InChI: InChI=1/C19H21ClN2O/c20-16-12-10-15(11-13-16)14-22(18-8-4-5-9-18)19(23)21-17-6-2-1-3-7-17/h1-3,6-7,10-13,18,21H,4-5,8-9,14H2
44 atoms
Cl 1.784037 4.980257 -0.624558
O  -0.622708 -2.788017 -0.869016
N  -1.513384 -0.932348 0.094976
N  0.7196 -1.453741 0.391104
C  -2.845005 -1.245024 -0.415102
C  -3.62428 -0.0142 -0.951157
C  -3.766653 -1.889088 0.636747
C  -4.935935 0.028303 -0.161993
C  -5.165204 -1.424456 0.248338
C  -1.395031 0.14349 1.055032
C  -0.484609 -1.790047 -0.172532
C  -0.589933 1.339994 0.594884
C  -0.14929 2.25576 1.546755
C  -0.278499 1.567479 -0.740229
C  1.959091 -2.071056 0.207706
C  0.575033 3.378822 1.182823
C  0.449071 2.686186 -1.122359
C  0.869388 3.584401 -0.156532
C  2.150877 -3.359215 -0.296155
C  3.080662 -1.327564 0.592294
C  3.438398 -3.867383 -0.413445
C  4.35586 -1.850848 0.477133
C  4.547588 -3.127991 -0.033139
H  -2.706212 -1.945003 -1.23412
H  -3.827312 -0.15722 -2.013766
H  -3.060901 0.916327 -0.872078
H  -3.523657 -1.512342 1.634904
H  -3.653933 -2.973814 0.666823
H  -5.760893 0.451294 -0.736696
H  -4.81905 0.644529 0.734258
H  -5.889387 -1.533294 1.057093
H  -5.53752 -2.00297 -0.602156
H  -0.992634 -0.222836 2.005717
H  -2.402486 0.484326 1.299622
H  0.788741 -0.572816 0.876047
H  -0.370185 2.091522 2.595129
H  -0.594979 0.868582 -1.503868
H  0.909627 4.078752 1.936635
H  0.686391 2.846161 -2.165629
H  1.316264 -3.972524 -0.591936
H  2.949268 -0.324594 0.983632
H  3.566456 -4.86742 -0.808437
H  5.203394 -1.250826 0.783161
H  5.543896 -3.538614 -0.130751
elementType: Cl O N C H
totalener: -1381.74128142 hartree
nucrepener: 2000.82800680 hartree
electener: -3382.56928822 hartree
oneelecener: -5860.95337886 hartree
twoeener: 2478.38409064 hartree
cpcmener: -0.02926149 hartree
kineticenergy: 1376.85446358 hartree
xcener: -112.745828838193 hartree
chargesum: -0.0000000
charge: -0.098411 -0.556144 -0.142968 -0.190914 0.064161 -0.180199 -0.172665 -0.148648 -0.117563 -0.041059 0.439680 0.028608 -0.229485 -0.218768 0.238108 -0.150431 -0.152624 0.102623 -0.256977 -0.254118 -0.132624 -0.126420 -0.204657 0.089323 0.095672 0.086831 0.078281 0.079565 0.077945 0.072456 0.072025 0.075306 0.133649 0.131050 0.180265 0.139901 0.150338 0.142695 0.142386 0.153304 0.133015 0.155203 0.155983 0.156304
qa: -0.0984 -0.5561 -0.1430 -0.1909 0.0642 -0.1802 -0.1727 -0.1486 -0.1176 -0.0411 0.4397 0.0286 -0.2295 -0.2188 0.2381 -0.1504 -0.1526 0.1026 -0.2570 -0.2541 -0.1326 -0.1264 -0.2047 0.0893 0.0957 0.0868 0.0783 0.0796 0.0779 0.0725 0.0720 0.0753 0.1336 0.1310 0.1803 0.1399 0.1503 0.1427 0.1424 0.1533 0.1330 0.1552 0.1560 0.1563
va: 1.2058 1.9532 3.0656 3.2440 3.7621 3.8798 3.9194 3.9320 3.8907 3.8096 4.2238 3.4964 4.0448 3.9595 3.7337 3.9834 4.0284 3.8252 3.9702 3.9535 3.9091 3.9022 3.9153 1.0399 1.0023 1.0135 1.0122 1.0185 1.0158 1.0084 1.0149 1.0082 0.9986 0.9836 1.0093 1.0045 1.0087 1.0061 1.0065 1.0358 1.0096 0.9921 0.9908 0.9914
dispcorr: -0.022250148 hartree
energy: -1381.763531572487
dipole: -23.10575 22.09270 -1.01305 -18.57557 19.82834 1.25277 4.51767 -2.97994 1.53774
magnitude: 2.22718 au
magnitude: 5.66105 debye
