program: Orca
programVersion: 5.0.2
elementType: Cl O N N C C C C C C C C C C C C C C C C C C C H H H H H H H H H H H H H H H H H H H H H
charge: 0
multiplicity: 1
keywords: wb97x-d3
keywords: def2-TZVPP
keywords: def2/J RIJCOSX
keywords: DEFGRID2
keywords: scfconv7
keywords: smallprint printgap noloewdin
keywords: NOSOSCF
formula: C19H21ClN2O
InChI: InChI=1/C19H21ClN2O/c20-16-12-10-15(11-13-16)14-22(18-8-4-5-9-18)19(23)21-17-6-2-1-3-7-17/h1-3,6-7,10-13,18,21H,4-5,8-9,14H2
44 atoms
Cl -0.622974 5.695004 1.493602
O  1.654487 -0.77853 -1.727235
N  -0.509409 -0.569452 -1.059894
N  0.802628 -2.319708 -0.294544
C  -1.627076 -1.029899 -0.238674
C  -3.013892 -0.547924 -0.664938
C  -1.548619 -0.655483 1.258608
C  -3.865912 -0.966685 0.527178
C  -3.010635 -0.581362 1.742345
C  -0.644383 0.660347 -1.819517
C  0.708303 -1.192079 -1.066245
C  -0.627062 1.918544 -0.984449
C  -1.621729 2.876847 -1.142981
C  0.3845 2.161529 -0.058218
C  1.89663 -3.169335 -0.121566
C  -1.627019 4.045073 -0.393551
C  0.392867 3.31859 0.704403
C  -0.619277 4.251436 0.532688
C  1.767019 -4.133541 0.885346
C  3.071841 -3.143563 -0.874928
C  2.777586 -5.043118 1.135905
C  4.079827 -4.061876 -0.607975
C  3.949033 -5.014274 0.390296
H  -1.678866 -2.119841 -0.329583
H  -3.338146 -0.984912 -1.610431
H  -3.0491 0.538853 -0.762679
H  -1.048657 0.306473 1.371138
H  -0.964525 -1.378603 1.830604
H  -4.034693 -2.046385 0.503877
H  -4.845126 -0.48738 0.5304
H  -3.24843 0.435458 2.058711
H  -3.200198 -1.228861 2.598441
H  -1.5660 0.624029 -2.400569
H  0.16371 0.699589 -2.547288
H  0.024371 -2.558857 0.297029
H  -2.41627 2.713143 -1.861662
H  1.183594 1.444087 0.081892
H  -2.413417 4.775546 -0.529267
H  1.181294 3.489105 1.425368
H  0.859126 -4.167531 1.477682
H  3.21235 -2.42598 -1.665587
H  2.644705 -5.777239 1.920306
H  4.983973 -4.02568 -1.202552
H  4.742535 -5.7237 0.584099
elementType: Cl O N C H
totalener: -1381.73941077 hartree
nucrepener: 1989.57014066 hartree
electener: -3371.30955143 hartree
oneelecener: -5838.62413888 hartree
twoeener: 2467.31458745 hartree
cpcmener: -0.02897593 hartree
kineticenergy: 1376.85206074 hartree
xcener: -112.747737037435 hartree
chargesum: 0.0000000
charge: -0.101465 -0.562910 -0.110291 -0.185403 -0.038822 -0.141391 -0.162518 -0.147392 -0.134313 -0.039169 0.430501 0.092424 -0.243755 -0.248446 0.239418 -0.130337 -0.132169 0.081923 -0.258665 -0.253390 -0.126455 -0.136600 -0.203108 0.090919 0.089403 0.086989 0.091083 0.085175 0.080802 0.077627 0.079458 0.074327 0.124848 0.121592 0.175202 0.144252 0.149416 0.142397 0.141214 0.135145 0.156583 0.155587 0.154651 0.155662
qa: -0.1015 -0.5629 -0.1103 -0.1854 -0.0388 -0.1414 -0.1625 -0.1474 -0.1343 -0.0392 0.4305 0.0924 -0.2438 -0.2484 0.2394 -0.1303 -0.1322 0.0819 -0.2587 -0.2534 -0.1265 -0.1366 -0.2031 0.0909 0.0894 0.0870 0.0911 0.0852 0.0808 0.0776 0.0795 0.0743 0.1248 0.1216 0.1752 0.1443 0.1494 0.1424 0.1412 0.1351 0.1566 0.1556 0.1547 0.1557
va: 1.2027 1.9366 3.1042 3.2512 3.8827 3.8963 3.8731 3.9258 3.9070 3.7978 4.2253 3.4763 4.0137 3.9710 3.7530 3.9790 4.0014 3.8361 3.9507 3.9604 3.9021 3.9131 3.9134 1.0104 1.0141 1.0146 1.0142 1.0141 1.0087 1.0136 1.0071 1.0125 0.9914 1.0294 1.0112 1.0019 1.0114 1.0051 1.0068 1.0104 1.0364 0.9909 0.9924 0.9915
dispcorr: -0.022434549 hartree
energy: -1381.761845316073
dipole: -11.45862 9.17028 -2.28834 -24.86285 23.71225 -1.15061 -0.29711 0.95965 0.66254
magnitude: 2.64563 au
magnitude: 6.72466 debye
