program: Orca
programVersion: 5.0.2
elementType: Cl O N N C C C C C C C C C C C C C C C C C C C H H H H H H H H H H H H H H H H H H H H H
charge: 0
multiplicity: 1
keywords: wb97x-d3
keywords: def2-TZVPP
keywords: def2/J RIJCOSX
keywords: DEFGRID2
keywords: scfconv7
keywords: smallprint printgap noloewdin
keywords: NOSOSCF
formula: C19H21ClN2O
InChI: InChI=1/C19H21ClN2O/c20-16-12-10-15(11-13-16)14-22(18-8-4-5-9-18)19(23)21-17-6-2-1-3-7-17/h1-3,6-7,10-13,18,21H,4-5,8-9,14H2
44 atoms
Cl -0.656392 5.542584 1.580448
O  1.649748 -0.851515 -1.751386
N  -0.526658 -0.639275 -1.125107
N  0.790814 -2.358354 -0.289559
C  -1.630517 -1.070684 -0.266969
C  -3.022661 -0.576674 -0.684835
C  -1.492606 -0.681905 1.234508
C  -3.82234 -0.670238 0.609015
C  -2.852228 -0.101507 1.64165
C  -0.634966 0.601929 -1.871443
C  0.694655 -1.252597 -1.094911
C  -0.63238 1.842931 -1.010817
C  -1.655844 2.777933 -1.112404
C  0.39898 2.087119 -0.10656
C  1.919272 -3.161698 -0.097889
C  -1.670879 3.922318 -0.326401
C  0.399017 3.219668 0.690908
C  -0.643091 4.128498 0.576956
C  1.982225 -3.886331 1.095431
C  2.941733 -3.321426 -1.035294
C  3.041774 -4.739968 1.352015
C  4.003529 -4.171628 -0.75966
C  4.067906 -4.884312 0.42831
H  -1.687142 -2.159927 -0.342511
H  -3.435491 -1.164349 -1.505896
H  -3.011928 0.466109 -1.000462
H  -0.677461 0.023628 1.392818
H  -1.262713 -1.566491 1.833446
H  -4.060076 -1.712375 0.841417
H  -4.765209 -0.124373 0.5568
H  -2.835593 0.988615 1.562734
H  -3.124667 -0.344957 2.669184
H  -1.537098 0.579583 -2.483443
H  0.195637 0.644932 -2.572739
H  0.048752 -2.544278 0.365403
H  -2.465743 2.616308 -1.814279
H  1.22358 1.390863 -0.015824
H  -2.480166 4.634494 -0.41719
H  1.205386 3.390534 1.39145
H  1.191627 -3.778199 1.829751
H  2.915687 -2.802091 -1.979297
H  3.065954 -5.290149 2.284071
H  4.788891 -4.279142 -1.497321
H  4.900268 -5.545875 0.628996
elementType: Cl O N C H
totalener: -1381.73871511 hartree
nucrepener: 2002.81892214 hartree
electener: -3384.55763724 hartree
oneelecener: -5865.20972519 hartree
twoeener: 2480.65208795 hartree
cpcmener: -0.02929697 hartree
kineticenergy: 1376.85182210 hartree
xcener: -112.746429807703 hartree
chargesum: -0.0000000
charge: -0.101217 -0.560322 -0.119384 -0.194334 -0.005773 -0.177661 -0.195586 -0.128411 -0.137023 -0.038155 0.418985 0.105163 -0.260301 -0.254576 0.223098 -0.123333 -0.129765 0.081953 -0.246093 -0.233415 -0.130417 -0.138765 -0.195920 0.100550 0.092146 0.091064 0.096083 0.097808 0.078055 0.075524 0.074232 0.078482 0.123092 0.123846 0.178705 0.144356 0.151637 0.142428 0.141810 0.138442 0.146280 0.155444 0.154881 0.156386
qa: -0.1012 -0.5603 -0.1194 -0.1943 -0.0058 -0.1777 -0.1956 -0.1284 -0.1370 -0.0382 0.4190 0.1052 -0.2603 -0.2546 0.2231 -0.1233 -0.1298 0.0820 -0.2461 -0.2334 -0.1304 -0.1388 -0.1959 0.1006 0.0921 0.0911 0.0961 0.0978 0.0781 0.0755 0.0742 0.0785 0.1231 0.1238 0.1787 0.1444 0.1516 0.1424 0.1418 0.1384 0.1463 0.1554 0.1549 0.1564
va: 1.2026 1.9363 3.1133 3.2380 3.8176 3.9049 3.8531 3.9044 3.9238 3.7935 4.2421 3.4576 4.0149 3.9705 3.7304 3.9626 3.9979 3.8404 3.9574 3.9703 3.9064 3.9141 3.9106 1.0064 1.0153 1.0149 1.0110 1.0077 1.0099 1.0155 1.0086 1.0149 0.9939 1.0302 1.0113 1.0022 1.0117 1.0052 1.0065 1.0086 1.0332 0.9914 0.9921 0.9911
dispcorr: -0.023170139 hartree
energy: -1381.761885246766
dipole: -10.82119 8.60157 -2.21962 -23.28949 22.22479 -1.06470 -0.59437 1.30465 0.71028
magnitude: 2.56219 au
magnitude: 6.51256 debye
