program: Orca
programVersion: 5.0.2
elementType: Cl O N N C C C C C C C C C C C C C C C C C C C H H H H H H H H H H H H H H H H H H H H H
charge: 0
multiplicity: 1
keywords: wb97x-d3
keywords: def2-TZVPP
keywords: def2/J RIJCOSX
keywords: DEFGRID2
keywords: scfconv7
keywords: smallprint printgap noloewdin
keywords: NOSOSCF
formula: C19H21ClN2O
InChI: InChI=1/C19H21ClN2O/c20-16-12-10-15(11-13-16)14-22(18-8-4-5-9-18)19(23)21-17-6-2-1-3-7-17/h1-3,6-7,10-13,18,21H,4-5,8-9,14H2
44 atoms
Cl 1.67714 4.979772 1.405017
O  -0.705625 -2.882162 0.35113
N  -1.480377 -0.814093 -0.199579
N  0.774976 -1.300614 -0.359752
C  -2.841057 -1.22004 0.121574
C  -3.643564 -1.761395 -1.070291
C  -3.717016 -0.094814 0.733263
C  -5.091037 -1.535136 -0.654833
C  -5.052142 -0.141988 -0.025179
C  -1.297341 0.346903 -1.038604
C  -0.481781 -1.756814 -0.042914
C  -0.53841 1.491746 -0.400671
C  0.073863 2.443973 -1.210343
C  -0.442413 1.633919 0.978521
C  1.978827 -2.010702 -0.351075
C  0.751617 3.521585 -0.665401
C  0.235014 2.705606 1.539244
C  0.826991 3.64643 0.71308
C  2.091644 -3.387975 -0.163385
C  3.1388 -1.263707 -0.571289
C  3.345028 -3.981398 -0.2016
C  4.380437 -1.87077 -0.605409
C  4.494743 -3.24016 -0.4205
H  -2.750948 -2.020934 0.851975
H  -3.395889 -2.801044 -1.283743
H  -3.428031 -1.184135 -1.975953
H  -3.251875 0.890138 0.668966
H  -3.865335 -0.284814 1.797066
H  -5.389933 -2.279358 0.08833
H  -5.794845 -1.609219 -1.484322
H  -5.063224 0.612321 -0.816503
H  -5.909224 0.063909 0.615887
H  -2.286562 0.711706 -1.324478
H  -0.811933 0.075802 -1.983027
H  0.89687 -0.3065 -0.464581
H  0.024764 2.345651 -2.288894
H  -0.890329 0.892472 1.62729
H  1.223093 4.254015 -1.305797
H  0.307152 2.803917 2.613438
H  1.218431 -3.99135 0.017751
H  3.068138 -0.190939 -0.71702
H  3.414945 -5.051179 -0.052928
H  5.26129 -1.265981 -0.776298
H  5.463454 -3.720117 -0.445162
totalener: -1381.71337346 hartree
nucrepener: 1994.38028640 hartree
electener: -3376.09365986 hartree
oneelecener: -5847.92430357 hartree
twoeener: 2471.83064371 hartree
kineticenergy: 1376.90106355 hartree
xcener: -112.749613444467 hartree
chargesum: -0.0000000
charge: -0.070900 -0.446966 -0.165902 -0.201718 0.068760 -0.177212 -0.188910 -0.114690 -0.137213 -0.105179 0.418393 0.017695 -0.200804 -0.168365 0.239358 -0.132439 -0.144059 0.101103 -0.206601 -0.235673 -0.099606 -0.105795 -0.159103 0.095466 0.093224 0.065009 0.079935 0.093968 0.074858 0.069598 0.068175 0.076005 0.109722 0.132689 0.146573 0.114572 0.139145 0.123838 0.124604 0.149178 0.095602 0.121836 0.120478 0.121352
qa: -0.0709 -0.4470 -0.1659 -0.2017 0.0688 -0.1772 -0.1889 -0.1147 -0.1372 -0.1052 0.4184 0.0177 -0.2008 -0.1684 0.2394 -0.1324 -0.1441 0.1011 -0.2066 -0.2357 -0.0996 -0.1058 -0.1591 0.0955 0.0932 0.0650 0.0799 0.0940 0.0749 0.0696 0.0682 0.0760 0.1097 0.1327 0.1466 0.1146 0.1391 0.1238 0.1246 0.1492 0.0956 0.1218 0.1205 0.1214
va: 1.2349 2.0624 3.0103 3.2342 3.7767 3.9242 3.8651 3.8937 3.9318 3.8815 4.2268 3.5792 4.0520 3.9780 3.8291 4.0174 4.0673 3.9311 4.0073 4.0035 3.9495 3.9853 3.9715 1.0376 1.0235 1.0146 1.0124 1.0059 1.0105 1.0166 1.0097 1.0182 0.9848 0.9991 1.0387 1.0134 1.0173 1.0133 1.0135 1.0375 1.0183 1.0014 1.0011 1.0011
dispcorr: -0.022066051 hartree
energy: -1381.735439507898
dipole: -22.57035 21.87237 -0.69798 -18.65762 19.62123 0.96362 -8.15816 7.48378 -0.67438
magnitude: 1.36767 au
magnitude: 3.47634 debye
