program: Orca
programVersion: 5.0.2
elementType: Cl O N N C C C C C C C C C C C C C C C C C C C H H H H H H H H H H H H H H H H H H H H H
charge: 0
multiplicity: 1
keywords: wb97x-d3
keywords: def2-TZVPP
keywords: def2/J RIJCOSX
keywords: DEFGRID2
keywords: scfconv7
keywords: smallprint printgap noloewdin
keywords: NOSOSCF
formula: C19H21ClN2O
InChI: InChI=1/C19H21ClN2O/c20-16-12-10-15(11-13-16)14-22(18-8-4-5-9-18)19(23)21-17-6-2-1-3-7-17/h1-3,6-7,10-13,18,21H,4-5,8-9,14H2
44 atoms
Cl 1.645117 5.146391 -0.583496
O  -0.724883 -2.772682 -0.733678
N  -1.488007 -0.825639 0.162963
N  0.759811 -1.355228 0.26111
C  -2.841572 -1.125726 -0.273606
C  -3.658258 0.07494 -0.751361
C  -3.741578 -1.772089 0.784334
C  -5.067489 -0.5064 -0.863659
C  -5.169818 -1.57736 0.249094
C  -1.29325 0.188304 1.170977
C  -0.496886 -1.736672 -0.146311
C  -0.555527 1.426569 0.705134
C  -0.422452 1.741225 -0.641481
C  0.008064 2.283663 1.646005
C  1.958127 -2.058817 0.10963
C  0.251121 2.884537 -1.043603
C  0.679492 3.431621 1.260883
C  0.797794 3.725418 -0.089136
C  3.134108 -1.33686 0.324761
C  2.047355 -3.414915 -0.203521
C  4.370634 -1.94819 0.229084
C  3.295405 -4.012568 -0.297319
C  4.461971 -3.295318 -0.085806
H  -2.747917 -1.817879 -1.110362
H  -3.291989 0.488812 -1.691875
H  -3.642091 0.884821 -0.015447
H  -3.621517 -1.25774 1.742556
H  -3.480371 -2.816901 0.951047
H  -5.19575 -0.969716 -1.843466
H  -5.838173 0.259233 -0.778473
H  -5.847975 -1.264605 1.042989
H  -5.572328 -2.508527 -0.149384
H  -0.782046 -0.230078 2.045098
H  -2.274959 0.491741 1.53977
H  0.892527 -0.388019 0.508762
H  -0.836861 1.079767 -1.390737
H  -0.072034 2.052033 2.702057
H  0.354774 3.114984 -2.094788
H  1.114921 4.087739 2.001653
H  3.080278 -0.280636 0.566598
H  1.159042 -3.997678 -0.380488
H  5.265572 -1.36414 0.399106
H  3.348331 -5.065165 -0.543524
H  5.426722 -3.777343 -0.165814
totalener: -1381.71346649 hartree
nucrepener: 1991.63252737 hartree
electener: -3373.34599386 hartree
oneelecener: -5842.44520214 hartree
twoeener: 2469.09920829 hartree
kineticenergy: 1376.90525404 hartree
xcener: -112.751156832794 hartree
chargesum: 0.0000000
charge: -0.071681 -0.442911 -0.148694 -0.207601 0.026763 -0.124376 -0.172406 -0.154122 -0.127634 -0.127865 0.417035 0.030583 -0.152467 -0.189590 0.237025 -0.156694 -0.137277 0.105281 -0.233368 -0.198011 -0.104773 -0.101155 -0.159115 0.091738 0.073536 0.070661 0.069819 0.090056 0.082419 0.075615 0.070666 0.078457 0.133868 0.112164 0.147534 0.131185 0.115354 0.123939 0.123510 0.095786 0.142206 0.120779 0.122091 0.121668
qa: -0.0717 -0.4429 -0.1487 -0.2076 0.0268 -0.1244 -0.1724 -0.1541 -0.1276 -0.1279 0.4170 0.0306 -0.1525 -0.1896 0.2370 -0.1567 -0.1373 0.1053 -0.2334 -0.1980 -0.1048 -0.1012 -0.1591 0.0917 0.0735 0.0707 0.0698 0.0901 0.0824 0.0756 0.0707 0.0785 0.1339 0.1122 0.1475 0.1312 0.1154 0.1239 0.1235 0.0958 0.1422 0.1208 0.1221 0.1217
va: 1.2338 2.0663 3.0094 3.2307 3.8743 3.8755 3.9310 3.9430 3.8768 3.8706 4.2276 3.5437 3.9795 4.0440 3.8216 4.0838 4.0200 3.9243 4.0024 4.0120 3.9836 3.9568 3.9722 1.0392 1.0183 1.0141 1.0140 1.0231 1.0090 1.0117 1.0106 1.0109 1.0015 0.9903 1.0368 1.0202 1.0122 1.0139 1.0134 1.0179 1.0374 1.0010 1.0012 1.0010
dispcorr: -0.021925459 hartree
energy: -1381.735391948936
dipole: -22.65444 21.96890 -0.68554 -19.96347 20.79612 0.83265 3.79700 -2.99042 0.80657
magnitude: 1.34679 au
magnitude: 3.42326 debye
