program: Orca
programVersion: 5.0.2
elementType: Br O O O O O C C C C C C C C C C C C C C C C C C C H H H H H H H H H H H H H H H H H H H H H
charge: 0
multiplicity: 1
keywords: wb97x-d3
keywords: def2-TZVPP
keywords: def2/J RIJCOSX
keywords: DEFGRID2
keywords: scfconv7
keywords: smallprint printgap noloewdin
keywords: NOSOSCF
formula: C19H21BrO5
InChI: InChI=1/C19H21BrO5/c1-10-9-14(23-4)18(24-5)19(25-6)15(10)17(21)16-11(2)12(20)7-8-13(16)22-3/h7-9H,1-6H3
46 atoms
Br 4.836003 -0.526265 0.174925
O  -0.584129 -1.423725 0.230972
O  -3.04045 -2.500632 -0.172435
O  -5.227865 -0.994081 0.004927
O  -0.454184 1.541136 -1.744078
O  0.033562 2.159532 1.769804
C  -1.528734 0.725103 0.739577
C  -2.680797 1.518912 0.862636
C  0.930945 0.885128 0.014302
C  -0.179907 1.309913 0.924857
C  -1.671777 -0.623306 0.374902
C  2.149311 0.422295 0.523194
C  -2.919184 -1.18207 0.147756
C  -3.927497 0.951946 0.619114
C  -4.062375 -0.383918 0.259368
C  0.730497 1.029565 -1.366682
C  -2.643894 2.98381 1.196056
C  3.142418 0.090948 -0.404531
C  1.734404 0.677518 -2.25751
C  2.390554 0.241094 1.993746
C  2.939268 0.204763 -1.767434
C  -0.20429 -2.127934 1.409584
C  -2.952878 -2.766441 -1.570505
C  -6.424993 -0.23858 0.098656
C  -0.752155 1.629638 -3.126511
H  -4.80071 1.585514 0.698621
H  -3.618703 3.43164 1.009551
H  -2.399997 3.160055 2.243059
H  -1.91358 3.52528 0.594815
H  1.607138 0.772264 -3.326547
H  1.4890 0.339426 2.588914
H  2.802283 -0.74617 2.202481
H  3.108541 0.974456 2.366213
H  3.717057 -0.065292 -2.46895
H  0.708601 -2.672222 1.176554
H  -0.971462 -2.84253 1.717243
H  -0.008975 -1.446245 2.240365
H  -3.739943 -2.256086 -2.130686
H  -3.07296 -3.840606 -1.700315
H  -1.983981 -2.469841 -1.97856
H  -6.581031 0.14964 1.107375
H  -7.235685 -0.920428 -0.144974
H  -6.436766 0.591252 -0.611248
H  -0.713126 0.652166 -3.613228
H  -0.078493 2.316294 -3.644762
H  -1.766398 2.015256 -3.19489
elementType: Br O C H
totalener: -3687.05923216 hartree
nucrepener: 2805.16993794 hartree
electener: -6492.22917010 hartree
twoeener: 4191.28626078 hartree
cpcmener: -0.03861977 hartree
kineticenergy: 3678.64151913 hartree
xcener: -176.340944725222 hartree
chargesum: 0.0000000
charge: -0.056826 -0.384337 -0.396413 -0.328666 -0.330350 -0.439328 -0.068450 -0.025740 -0.018609 0.225396 0.229567 0.057058 0.129793 -0.188098 0.275908 0.333371 -0.230169 -0.098267 -0.265708 -0.285932 -0.094437 -0.126596 -0.101943 -0.128889 -0.134068 0.126115 0.092367 0.101970 0.104423 0.145154 0.097784 0.108695 0.129304 0.141664 0.124055 0.119124 0.113779 0.104139 0.122749 0.102204 0.117780 0.126658 0.116810 0.116891 0.120358 0.119708
qa: -0.0568 -0.3843 -0.3964 -0.3287 -0.3304 -0.4393 -0.0684 -0.0257 -0.0186 0.2254 0.2296 0.0571 0.1298 -0.1881 0.2759 0.3334 -0.2302 -0.0983 -0.2657 -0.2859 -0.0944 -0.1266 -0.1019 -0.1289 -0.1341 0.1261 0.0924 0.1020 0.1044 0.1452 0.0978 0.1087 0.1293 0.1417 0.1241 0.1191 0.1138 0.1041 0.1227 0.1022 0.1178 0.1267 0.1168 0.1169 0.1204 0.1197
va: 1.2259 1.9230 1.9493 2.0786 2.0639 2.0121 3.5334 3.8404 3.3791 3.7895 3.8581 3.5785 3.9000 3.8383 3.9312 3.7865 3.8833 3.9645 3.9660 3.9250 3.8876 3.8531 3.8476 3.8644 3.8727 1.0184 1.0054 1.0055 1.0038 1.0065 1.0102 0.9944 0.9963 0.9992 0.9898 0.9994 0.9820 0.9906 0.9934 0.9943 0.9862 0.9928 0.9868 0.9860 0.9854 0.9936
dispcorr: -0.026758180 hartree
energy: -3687.085990342742
dipole: -75.32995 73.19020 -2.13975 6.85521 -6.93133 -0.07612 -6.05055 4.06741 -1.98314
magnitude: 2.91842 au
magnitude: 7.41803 debye
