program: Orca
programVersion: 5.0.2
elementType: Br O O O O O C C C C C C C C C C C C C C C C C C C H H H H H H H H H H H H H H H H H H H H H
charge: 0
multiplicity: 1
keywords: wb97x-d3
keywords: def2-TZVPP
keywords: def2/J RIJCOSX
keywords: DEFGRID2
keywords: scfconv7
keywords: smallprint printgap noloewdin
keywords: NOSOSCF
formula: C19H21BrO5
InChI: InChI=1/C19H21BrO5/c1-10-9-14(23-4)18(24-5)19(25-6)15(10)17(21)16-11(2)12(20)7-8-13(16)22-3/h7-9H,1-6H3
46 atoms
Br 3.653617 -1.193608 1.586772
O  -0.789535 -0.533932 -1.564756
O  -2.909742 -2.157893 -0.838753
O  -4.599332 -1.389157 1.013344
O  1.001015 2.068733 -2.692818
O  -0.335895 3.159323 -0.402571
C  -1.476644 1.131483 0.004054
C  -2.413248 1.567258 0.954272
C  1.029269 1.248166 -0.514915
C  -0.285057 1.950149 -0.325442
C  -1.654629 -0.121133 -0.605315
C  1.604421 0.518435 0.525983
C  -2.708567 -0.952312 -0.256213
C  -3.470218 0.730042 1.29433
C  -3.622468 -0.525057 0.715659
C  1.659631 1.361612 -1.760569
C  -2.311519 2.885486 1.668008
C  2.818782 -0.125523 0.262899
C  2.872388 0.725505 -1.981937
C  0.951051 0.43694 1.875334
C  3.444236 -0.022255 -0.964866
C  -1.268778 -0.382558 -2.897288
C  -1.897377 -3.145045 -0.651554
C  -5.555844 -1.025617 1.991878
C  1.588277 2.232512 -3.968513
H  -4.16783 1.06977 2.048317
H  -3.002444 2.910149 2.509223
H  -1.311418 3.071423 2.060959
H  -2.56067 3.722014 1.01556
H  3.383047 0.786474 -2.932856
H  1.683058 0.526341 2.677099
H  0.226951 1.231389 2.036212
H  0.432327 -0.514055 2.013284
H  4.385258 -0.522407 -1.15192
H  -0.453909 -0.66312 -3.562178
H  -1.556558 0.651018 -3.103405
H  -2.123329 -1.031169 -3.102437
H  -1.205123 -3.178283 -1.494123
H  -2.396887 -4.110809 -0.577245
H  -1.330673 -2.977361 0.266501
H  -6.12447 -0.139698 1.699222
H  -5.095188 -0.850424 2.9672
H  -6.240388 -1.866679 2.07676
H  0.890351 2.828062 -4.552546
H  1.743311 1.278416 -4.478279
H  2.539881 2.766816 -3.911934
elementType: Br O C H
totalener: -3687.06647303 hartree
nucrepener: 2818.46965337 hartree
electener: -6505.53612639 hartree
twoeener: 4204.24170620 hartree
cpcmener: -0.03262088 hartree
kineticenergy: 3678.65426883 hartree
xcener: -176.342255527169 hartree
chargesum: -0.0000000
charge: -0.058714 -0.375168 -0.376239 -0.313138 -0.304445 -0.395076 -0.114841 -0.002825 -0.016280 0.241424 0.236393 0.013978 0.137159 -0.179907 0.202627 0.342775 -0.223297 -0.120292 -0.287683 -0.236218 -0.078197 -0.132336 -0.096927 -0.130632 -0.146240 0.121803 0.090506 0.101885 0.105330 0.139748 0.112810 0.094115 0.114986 0.138913 0.123084 0.113393 0.121547 0.101186 0.118610 0.105185 0.115368 0.114391 0.124554 0.121899 0.110941 0.123846
qa: -0.0587 -0.3752 -0.3762 -0.3131 -0.3044 -0.3951 -0.1148 -0.0028 -0.0163 0.2414 0.2364 0.0140 0.1372 -0.1799 0.2026 0.3428 -0.2233 -0.1203 -0.2877 -0.2362 -0.0782 -0.1323 -0.0969 -0.1306 -0.1462 0.1218 0.0905 0.1019 0.1053 0.1397 0.1128 0.0941 0.1150 0.1389 0.1231 0.1134 0.1215 0.1012 0.1186 0.1052 0.1154 0.1144 0.1246 0.1219 0.1109 0.1238
va: 1.2239 1.9373 1.9890 2.0945 2.0796 2.0676 3.5121 3.7830 3.2994 3.8964 3.7996 3.6278 3.8987 3.8323 3.9943 3.7819 3.8938 3.9984 3.9884 3.9187 3.8689 3.8378 3.8581 3.8710 3.8779 1.0188 1.0058 0.9992 1.0044 1.0091 1.0056 1.0103 0.9947 0.9999 0.9909 0.9936 0.9963 0.9866 0.9954 0.9920 0.9858 0.9862 0.9935 0.9936 0.9851 0.9869
dispcorr: -0.026994688 hartree
energy: -3687.093467713750
dipole: -55.42714 54.64181 -0.78533 15.01115 -15.80640 -0.79525 -21.62247 21.21115 -0.41132
magnitude: 1.19094 au
magnitude: 3.02713 debye
