program: Orca
programVersion: 5.0.2
elementType: Br O O O O O C C C C C C C C C C C C C C C C C C C H H H H H H H H H H H H H H H H H H H H H
charge: 0
multiplicity: 1
keywords: wb97x-d3
keywords: def2-TZVPP
keywords: def2/J RIJCOSX
keywords: DEFGRID2
keywords: scfconv7
keywords: smallprint printgap noloewdin
keywords: NOSOSCF
formula: C19H21BrO5
InChI: InChI=1/C19H21BrO5/c1-10-9-14(23-4)18(24-5)19(25-6)15(10)17(21)16-11(2)12(20)7-8-13(16)22-3/h7-9H,1-6H3
46 atoms
Br 3.693107 -1.164294 1.585046
O  -0.775485 -0.53344 -1.552268
O  -2.907852 -2.151994 -0.852501
O  -4.618067 -1.379974 0.97995
O  0.992012 2.079141 -2.677669
O  -0.335263 3.159089 -0.37845
C  -1.469266 1.126728 0.019164
C  -2.411679 1.561049 0.964399
C  1.037761 1.255014 -0.501871
C  -0.279145 1.949822 -0.304903
C  -1.64667 -0.122682 -0.598586
C  1.625125 0.529709 0.534769
C  -2.708418 -0.950127 -0.263559
C  -3.476018 0.7273 1.289118
C  -3.630934 -0.522355 0.699875
C  1.658163 1.371555 -1.752526
C  -2.313256 2.8749 1.686192
C  2.839909 -0.110017 0.26279
C  2.871455 0.739532 -1.983136
C  0.983696 0.448229 1.88969
C  3.454502 -0.005371 -0.970392
C  -1.243802 -0.388689 -2.889556
C  -1.918385 -3.151285 -0.638043
C  -5.587779 -1.012682 1.943528
C  1.545534 2.205813 -3.972423
H  -4.17942 1.065494 2.038414
H  -3.005358 2.892579 2.527051
H  -1.314228 3.062775 2.081018
H  -2.566065 3.71438 1.038585
H  3.374946 0.80299 -2.937738
H  0.248607 1.232762 2.050286
H  0.480946 -0.509417 2.039919
H  1.721184 0.554954 2.684424
H  4.396822 -0.499987 -1.165544
H  -1.548759 0.639683 -3.098216
H  -2.083701 -1.05295 -3.10554
H  -0.417058 -0.653367 -3.546183
H  -2.429531 -4.11376 -0.606581
H  -1.393317 -3.010165 0.309759
H  -1.18396 -3.178188 -1.44585
H  -6.279715 -1.848912 2.013986
H  -6.144856 -0.121387 1.644117
H  -5.142737 -0.843573 2.927377
H  2.504598 2.729681 -3.95568
H  0.838072 2.795297 -4.551097
H  1.676052 1.23726 -4.46182
elementType: Br O C H
totalener: -3687.06653224 hartree
nucrepener: 2816.90477483 hartree
electener: -6503.97130707 hartree
twoeener: 4202.67231391 hartree
cpcmener: -0.03266509 hartree
kineticenergy: 3678.65845756 hartree
xcener: -176.343189855087 hartree
chargesum: -0.0000000
charge: -0.058484 -0.374753 -0.376322 -0.312959 -0.303814 -0.395193 -0.123853 0.000026 -0.012946 0.245833 0.235840 0.012031 0.137410 -0.180040 0.206701 0.339807 -0.224104 -0.120781 -0.286967 -0.233823 -0.078518 -0.132432 -0.097741 -0.130968 -0.146229 0.121580 0.090669 0.101937 0.105257 0.139707 0.092504 0.114974 0.112580 0.138936 0.113683 0.122242 0.122309 0.118305 0.104964 0.101160 0.124598 0.115569 0.114317 0.123830 0.122318 0.110837
qa: -0.0585 -0.3748 -0.3763 -0.3130 -0.3038 -0.3952 -0.1239 0.0000 -0.0129 0.2458 0.2358 0.0120 0.1374 -0.1800 0.2067 0.3398 -0.2241 -0.1208 -0.2870 -0.2338 -0.0785 -0.1324 -0.0977 -0.1310 -0.1462 0.1216 0.0907 0.1019 0.1053 0.1397 0.0925 0.1150 0.1126 0.1389 0.1137 0.1222 0.1223 0.1183 0.1050 0.1012 0.1246 0.1156 0.1143 0.1238 0.1223 0.1108
va: 1.2241 1.9397 1.9873 2.0949 2.0802 2.0673 3.5187 3.7791 3.2937 3.8934 3.8039 3.6325 3.8884 3.8323 3.9941 3.7852 3.8942 3.9978 3.9870 3.9164 3.8689 3.8378 3.8584 3.8710 3.8771 1.0187 1.0056 0.9992 1.0042 1.0090 1.0111 0.9951 1.0054 0.9998 0.9934 0.9966 0.9910 0.9952 0.9921 0.9869 0.9935 0.9859 0.9861 0.9867 0.9934 0.9855
dispcorr: -0.026968812 hartree
energy: -3687.093501052196
dipole: -56.02711 55.19654 -0.83057 14.57327 -15.39252 -0.81925 -21.64048 21.21198 -0.42850
magnitude: 1.24283 au
magnitude: 3.15903 debye
