program: Gaussian 09
title: 000066078
version: EM64L-G09RevD.01
frameworkgroup: C1[X(C9H17N)]
method: RPBEPBE
basis: SDD
operation: Freq
keyword: #pfreq=noraman
keyword: PBEPBE/SDD
title: #p freq=noraman PBEPBE/SDD
converged: NO YES NO NO
title: Mulliken charges:
elementType: N C C C C C C C C C H H H H H H H H H H H H H H H H H
charge: -0.327335 0.028778 -0.068605 -0.474295 -0.485060 -0.467852 -0.399933 -0.390952 -0.363530 -0.425426 0.215036 0.176470 0.192845 0.196981 0.210749 0.189986 0.214020 0.180466 0.193235 0.196102 0.197976 0.191415 0.184711 0.208644 0.245765 0.171395 0.208415
chargesum: 0.00000
title: Mulliken charges with hydrogens summed into heavy atoms:
elementType: N C C C C C C C C C
charge: -0.081570 0.243814 0.107865 -0.084469 -0.084325 -0.073367 -0.010596 -0.001561 0.029825 -0.045616
polarizability: 1.14191266e+02 -2.35841366e-01 9.87441423e+01 -2.43839835e-01 2.19017286e-01 8.16514690e+01
1716.lowfreq: -16.6889 -0.0008 -0.0006 -0.0004 17.6086 21.1417 126.8326 135.7119 222.0510
frequency: 126.7956 135.7087 222.0375 288.4501 293.5717 339.0244 355.5878 399.3481 405.6304 433.9586 492.2010 524.1181 546.7432 685.1667 762.0755 823.7120 829.7973 841.1718 870.5568 887.8740 895.0287 910.1783 981.9159 988.8628 1018.6820 1042.7824 1054.1560 1071.0807 1105.6461 1109.3136 1132.4918 1147.8439 1156.8094 1167.6750 1173.5582 1235.6173 1236.1911 1249.4922 1258.6734 1283.1514 1299.2194 1306.3948 1325.4713 1329.0230 1332.6523 1335.8626 1340.8013 1344.9321 1352.2161 1376.6977 1446.5593 1454.0966 1458.8123 1461.5178 1464.6306 1467.8693 1471.7870 1475.2062 2792.5099 2840.4015 2950.1467 2952.2734 2960.6291 2964.3265 2966.6259 2969.2803 2984.0909 3013.5713 3020.5405 3022.1254 3027.6924 3029.4779 3040.3897 3049.6525 3420.9778
redmass: 2.4693 2.5199 2.0202 1.9211 2.8207 1.6841 1.9777 3.7247 3.8431 3.2126 2.5133 1.8733 1.5572 1.6222 1.9899 1.5906 1.8688 2.4284 2.0698 1.5950 1.4948 2.5110 1.8298 1.9100 1.6858 1.9412 1.2743 1.4694 2.2676 2.1066 1.9658 2.6752 2.1716 1.4897 1.4809 1.3841 1.3221 1.2951 1.2007 1.2727 1.2265 1.2402 1.3893 1.3769 1.4601 1.4319 1.4461 1.5249 1.7268 1.4812 1.2885 1.1032 1.1132 1.0899 1.1057 1.0850 1.0886 1.0962 1.0788 1.0705 1.0658 1.0657 1.0601 1.0722 1.0629 1.0653 1.0619 1.0982 1.0987 1.0968 1.0996 1.0886 1.1028 1.1034 1.0746
irintensity: 0.2030 0.4670 0.9388 0.5331 0.3378 1.4852 1.8960 0.4868 1.0644 11.1600 8.2130 3.8985 26.9149 73.2207 3.0344 3.0851 3.2477 6.6828 1.1525 0.3098 7.3832 0.6948 1.6557 12.3903 1.2344 1.5276 1.4849 2.0007 0.6336 1.2662 4.2356 26.2005 0.5981 2.2542 9.2185 5.1728 1.2964 1.7890 0.4411 0.5984 15.4397 0.4153 8.0043 8.0655 0.8401 0.3607 1.2454 2.9435 4.4324 0.6884 5.3771 8.8227 2.7803 7.9390 6.6910 13.5588 13.8589 2.7319 70.2314 132.1869 18.2353 11.0502 25.5025 80.2363 39.7822 48.5466 33.5854 5.0712 92.4877 51.8700 57.5077 56.5056 104.3226 79.6864 4.6333
temp: 298.150 k
press: 1.00000 atm
elementType: 7 6 6 6 6 6 6 6 6 6 1 1 1 1 1 1 1 1 1 1 1 1 1 1 1 1 1
symmnumber: 1
zpe: 649160.4 jmol-1
zpe.correction: 0.247252 hartree
zpe.thermalcorrener: 0.256280 hartree
zpe.thermalcorrenthalpy: 0.257225 hartree
zpe.thermalcorrgfe: 0.213990 hartree
zpe.sumelectzpe: -407.092915 hartree
zpe.sumelectthermal: -407.083887 hartree
zpe.sumelectthermalent: -407.082942 hartree
zpe.sumelectthermalfe: -407.126177 hartree
dipole: 0.0944 -0.1743 0.8518
dipole: 0.8745
quadrupole: -62.3078 -61.3671 -64.3249
quadrupole: 0.2277 -1.2543 -1.8430
quadrupole: 0.3588 1.2995 -1.6583 0.2277 -1.2543 -1.8430
hfenergy: -407.3401669 hartree
pointgroup: C01 [X(C9H17N1)]
dipole: -0.0386783 0.0655005 0.335549 debye
dipolederiv: -0.6897075 0.0007327 -0.0266763 0.012704 -0.2922385 0.1185018 0.0088466 0.2076346 -0.5345894 0.0032623 0.014226 -0.0015693 -0.0266947 -0.0028289 0.0160625 0.0005227 0.0244019 0.1191829 0.3885354 0.1243169 -0.0800019 0.219284 0.1881005 -0.0390453 -0.0562872 0.0003841 0.3823035 -0.007002 0.0161638 0.0021588 0.0199332 0.0753855 0.0218792 -0.02183 -0.0095308 0.1544686 -0.0179383 -0.0137898 -0.0029774 -0.021717 0.08382 0.0212599 0.0248688 -0.0151796 0.1586417 -0.0500425 -0.0336552 -0.0007195 0.0023011 0.0977575 0.0289067 0.0278885 0.0112927 0.1299656 0.0558293 0.0159791 -0.0183658 0.0029617 0.0481377 -0.0158343 0.0270236 -0.0003751 0.154644 0.0764935 -0.016695 0.0148897 0.0024338 0.042796 -0.0160984 -0.0242848 -0.005785 0.1574711 0.0706485 -0.0292902 0.0273629 0.0113193 0.0056526 -0.0197484 -0.0152179 -0.0325174 0.1290719 0.4317406 -0.089628 0.1007031 -0.2159438 0.1972387 -0.0822306 0.0951456 -0.0493947 0.4089497 0.0390631 0.0020783 -0.0060833 0.0048734 0.0345643 0.0370687 -0.0102754 0.0092901 -0.1726958 -0.0531245 -0.002756 -0.0021087 -0.0421409 -0.0165918 0.0508864 0.089671 0.0390094 -0.2835872 0.0218374 0.0059312 -0.0318011 0.0051681 0.0734177 -0.01017 0.0023568 0.0616972 -0.1869549 0.0380339 0.0250872 0.0060414 -0.0119499 -0.207518 -0.06574 -0.001598 -0.0966014 0.0454752 0.0393274 -0.0176137 -0.0086348 0.0188984 -0.2043076 -0.0731792 0.0012258 -0.1004269 0.0434381 0.0218439 -0.0077732 0.032757 -0.0036138 0.0688498 -0.0089976 -0.0023634 0.0685791 -0.1883354 0.0436287 -0.0043747 0.0262816 -0.0025827 0.0754936 -0.013443 -0.0072112 0.0534625 -0.1603077 0.0280845 -0.0364493 -0.0086833 0.0039393 -0.2299815 -0.0671919 -0.0114758 -0.105276 0.0435195 -0.1864496 -0.1116104 0.0463035 -0.116903 -0.0281459 0.026602 0.0827697 0.0446327 0.0560793 0.0703165 0.0244318 0.016733 0.0334305 0.0326792 0.0105721 -0.0561516 -0.022556 -0.1941449 -0.1702725 0.1146394 -0.0489908 0.1211273 -0.0316889 0.0284513 -0.0821679 0.0467983 0.0569827 0.0666352 -0.024504 -0.0164643 -0.035755 0.0331282 0.0107934 0.055489 -0.0247837 -0.1979406 -0.1917931 0.1005848 -0.0526324 0.1040476 -0.0018701 0.0246708 -0.0946412 0.0461164 0.0542713 0.0730013 -0.0251205 -0.0144608 -0.0339199 0.0414949 0.0053325 0.0608583 -0.0210479 -0.17606 0.0871 0.0425105 0.0067192 -0.0067193 -0.0505102 -0.0561429 0.0064715 -0.1925184 0.246572 -0.0314265 0.0286521 0.0092844 0.085443 0.0074832 0.0336946 -0.1614892 0.0009835 -0.3008392 -0.157625 -0.1020735 0.0309354 -0.1299246 -0.0403182 0.0331398 0.0618556 0.0617104 0.0544179 unknown
polarizability: 114.1872503|-0.2650789|98.7476289|0.4000749|-0.061414|81.6519979 unknown
InChI: InChI=1S/C9H17N/c1-2-6-9-8(4-1)5-3-7-10-9/h8-10H,1-7H2
charge 0 multiplicity 1
27 atoms
N  1.238065 1.400373 -0.193294
C  0.007451 -0.747782 -0.261081
C  0.012332 0.709442 0.274597
C  -1.276434 -1.48072 0.193044
C  1.300351 -1.478354 0.174574
C  -1.246403 1.472603 -0.186957
C  -2.551867 -0.722732 -0.246783
C  -2.536942 0.743051 0.25383
C  2.559895 -0.687018 -0.250168
C  2.488621 0.76149 0.280078
H  0.005108 -0.675323 -1.370304
H  -0.013525 0.640984 1.398074
H  -1.269773 -1.57982 1.299615
H  -1.282266 -2.510593 -0.216712
H  1.322136 -2.500314 -0.252791
H  1.294376 -1.594366 1.279995
H  -1.214737 1.559244 -1.291596
H  -1.232602 2.505329 0.220019
H  -3.455336 -1.243215 0.126734
H  -2.612465 -0.726805 -1.354792
H  -3.426059 1.285113 -0.122356
H  -2.602538 0.749475 1.361804
H  3.476663 -1.178611 0.129612
H  2.623723 -0.655322 -1.354908
H  1.208631 2.406963 0.024103
H  2.553798 0.73106 1.399089
H  3.349098 1.349447 -0.090027
