program: Orca
programVersion: 5.0.2
elementType: Br O O O O O C C C C C C C C C C C C C C C C C C C H H H H H H H H H H H H H H H H H H H H H
charge: 0
multiplicity: 1
keywords: wb97x-d3
keywords: def2-TZVPP
keywords: def2/J RIJCOSX
keywords: DEFGRID2
keywords: scfconv7
keywords: smallprint printgap noloewdin
keywords: NOSOSCF
formula: C19H21BrO5
InChI: InChI=1/C19H21BrO5/c1-10-9-14(23-4)18(24-5)19(25-6)15(10)17(21)16-11(2)12(20)7-8-13(16)22-3/h7-9H,1-6H3
46 atoms
Br 3.015243 -0.271034 -3.033661
O  -0.250977 -1.18826 1.197844
O  -2.581279 -2.571476 0.920535
O  -4.854452 -1.300437 0.405535
O  1.871179 1.087251 2.695264
O  -0.055074 2.767377 1.390673
C  -1.363062 0.895709 0.806395
C  -2.566456 1.573848 0.53587
C  1.194189 1.018468 0.468647
C  -0.089852 1.641601 0.939008
C  -1.388998 -0.505063 0.928905
C  1.405903 0.736329 -0.879954
C  -2.568779 -1.219992 0.785411
C  -3.742452 0.845895 0.399208
C  -3.761573 -0.539134 0.521532
C  2.190595 0.785506 1.426194
C  -2.657381 3.061463 0.344925
C  2.642308 0.182823 -1.233121
C  3.407238 0.242262 1.041243
C  0.358572 1.024928 -1.91514
C  3.625385 -0.060268 -0.293687
C  -0.089844 -1.596778 2.552035
C  -2.317315 -3.278533 -0.285686
C  -6.107047 -0.671405 0.203344
C  2.814992 0.831455 3.716591
H  -4.654593 1.384616 0.179416
H  -2.567755 3.599576 1.288285
H  -1.884469 3.44621 -0.320182
H  -3.622031 3.322016 -0.088621
H  4.193715 0.041862 1.755511
H  -0.088324 0.106034 -2.299429
H  -0.450437 1.642157 -1.533129
H  0.780812 1.561038 -2.765315
H  4.576575 -0.487163 -0.582568
H  0.914256 -2.008397 2.639949
H  -0.807587 -2.369843 2.833364
H  -0.190499 -0.755837 3.241466
H  -1.320237 -3.060205 -0.675939
H  -3.053617 -3.051075 -1.060955
H  -2.37504 -4.340844 -0.053374
H  -6.847215 -1.467928 0.177088
H  -6.144052 -0.128394 -0.744064
H  -6.355554 0.011147 1.019575
H  2.34085 1.12291 4.651029
H  3.725167 1.422922 3.588032
H  3.082089 -0.226674 3.775347
elementType: Br O C H
totalener: -3687.06770196 hartree
nucrepener: 2806.13035176 hartree
electener: -6493.19805372 hartree
twoeener: 4192.03384300 hartree
cpcmener: -0.03214283 hartree
kineticenergy: 3678.65452594 hartree
xcener: -176.341537371719 hartree
chargesum: 0.0000000
charge: -0.059107 -0.365596 -0.381996 -0.312322 -0.303729 -0.401316 -0.199743 0.022839 0.001857 0.255810 0.228672 0.004702 0.149640 -0.191098 0.263379 0.337849 -0.217240 -0.123227 -0.280621 -0.223430 -0.087551 -0.131359 -0.102237 -0.132357 -0.144414 0.122866 0.102646 0.100581 0.090107 0.139322 0.112349 0.085648 0.113115 0.138527 0.120225 0.120376 0.110791 0.101682 0.102435 0.119837 0.124859 0.114942 0.116633 0.122764 0.122826 0.110064
qa: -0.0591 -0.3656 -0.3820 -0.3123 -0.3037 -0.4013 -0.1997 0.0228 0.0019 0.2558 0.2287 0.0047 0.1496 -0.1911 0.2634 0.3378 -0.2172 -0.1232 -0.2806 -0.2234 -0.0876 -0.1314 -0.1022 -0.1324 -0.1444 0.1229 0.1026 0.1006 0.0901 0.1393 0.1123 0.0856 0.1131 0.1385 0.1202 0.1204 0.1108 0.1017 0.1024 0.1198 0.1249 0.1149 0.1166 0.1228 0.1228 0.1101
va: 1.2235 1.9546 1.9600 2.0980 2.0755 2.0631 3.5929 3.7697 3.2960 3.8682 3.8756 3.6556 3.8518 3.8431 3.9672 3.7829 3.8921 3.9887 3.9863 3.9032 3.8816 3.8444 3.8540 3.8705 3.8760 1.0186 1.0051 1.0004 1.0052 1.0089 0.9968 1.0171 1.0025 1.0002 0.9912 1.0019 0.9927 0.9930 0.9904 0.9939 0.9934 0.9855 0.9867 0.9935 0.9867 0.9860
dispcorr: -0.026679411 hartree
energy: -3687.094381372964
dipole: -48.00532 46.95157 -1.05375 1.80315 -2.70347 -0.90032 42.37831 -41.94403 0.43428
magnitude: 1.45244 au
magnitude: 3.69180 debye
