program: Gaussian 09
title: 000066075
version: EM64L-G09RevD.01
frameworkgroup: C1[X(C8H16N2)]
method: RPBEPBE
basis: SDD
operation: Freq
keyword: #pfreq=noraman
keyword: PBEPBE/SDD
title: #p freq=noraman PBEPBE/SDD
converged: YES YES NO NO
title: Mulliken charges:
elementType: N N C C C C C C C C H H H H H H H H H H H H H H H H
charge: -0.081175 -0.081176 -0.413106 -0.413108 -0.624710 -0.612953 -0.624710 -0.612952 -0.012291 -0.012286 0.235591 0.208327 0.208331 0.235589 0.183446 0.220926 0.257879 0.228041 0.185304 0.224718 0.257880 0.183445 0.220925 0.228040 0.185303 0.224719
chargesum: 0.00000
title: Mulliken charges with hydrogens summed into heavy atoms:
elementType: N N C C C C C C C C
charge: -0.081175 -0.081176 0.030813 0.030811 0.037541 0.025111 0.037541 0.025111 -0.012291 -0.012286
polarizability: 1.39546792e+02 -4.83722779e-04 8.83614861e+01 2.68629082e+00 3.30029005e-04 7.75189065e+01
1716.lowfreq: 0.0002 0.0007 0.0008 4.5654 6.3751 16.2084 22.2171 44.6926 50.0885
frequency: 22.1539 44.6663 50.0739 93.4729 149.4230 214.7338 239.6095 243.4439 244.7832 252.1500 292.6965 313.7202 324.7588 330.0049 361.7798 373.4587 398.3123 456.0765 571.3217 793.9970 798.2072 823.5327 964.5742 976.6269 1008.0962 1024.7447 1034.9474 1035.7938 1091.1060 1092.3362 1131.5774 1133.8525 1163.0322 1166.5227 1172.1217 1250.1601 1251.9061 1263.3574 1265.6747 1350.9325 1356.6678 1417.1668 1418.3667 1438.9344 1440.3826 1455.1982 1455.4388 1459.0588 1460.3818 1472.1801 1473.1706 1475.8404 1478.2599 1485.1650 1486.6310 2290.5715 2809.8599 2810.2452 2842.1852 2842.3720 2858.5622 2859.2121 2998.5755 2998.6445 3018.8121 3018.8555 3030.0569 3030.5936 3079.3064 3079.3746 3091.8281 3091.9701
redmass: 2.5004 3.8436 2.8104 2.7199 3.6221 2.5472 1.1558 1.0500 1.0926 1.1516 2.4769 2.1683 2.1887 3.1575 4.0377 3.5151 2.1200 2.7344 5.9651 4.9051 4.9288 3.5605 1.6771 1.6583 2.4467 2.3437 1.5287 1.5236 1.2567 1.2506 1.3618 1.4056 2.9227 1.7814 1.8924 2.2305 2.3067 1.7267 1.5799 1.5750 1.3670 1.1403 1.1402 1.1678 1.1669 1.0736 1.0753 1.0471 1.0488 1.0622 1.0602 1.0548 1.0518 1.0526 1.0532 11.7591 1.0704 1.0705 1.0575 1.0576 1.0569 1.0572 1.0843 1.0844 1.0716 1.0715 1.0727 1.0726 1.1009 1.1009 1.1009 1.1010
irintensity: 0.4832 1.1637 2.9996 0.4678 0.5661 4.0108 0.6453 0.8363 0.0210 2.1444 1.1796 26.2380 0.0007 3.7964 0.0012 0.7488 0.5703 0.0635 0.6506 5.3815 39.6199 2.8668 0.3899 2.5361 46.2288 43.7156 31.6454 4.0901 14.2480 1.8874 6.6609 4.0703 7.8882 3.0995 10.8476 8.8672 12.4310 1.4746 8.4234 78.1791 0.0066 4.1043 2.5458 6.1027 5.7957 3.4117 0.8921 30.0814 1.5280 10.1238 13.8645 24.1940 6.1727 2.1096 27.8242 0.0001 114.7995 32.2140 141.0933 35.6833 438.1246 3.2382 30.4630 17.9875 86.0292 2.6007 10.5049 63.0304 9.5322 51.2151 40.9245 15.3583
temp: 298.150 k
press: 1.00000 atm
elementType: 7 7 6 6 6 6 6 6 6 6 1 1 1 1 1 1 1 1 1 1 1 1 1 1 1 1
symmnumber: 1
zpe: 593907.7 jmol-1
zpe.correction: 0.226207 hartree
zpe.thermalcorrener: 0.239310 hartree
zpe.thermalcorrenthalpy: 0.240254 hartree
zpe.thermalcorrgfe: 0.185786 hartree
zpe.sumelectzpe: -423.022640 hartree
zpe.sumelectthermal: -423.009538 hartree
zpe.sumelectthermalent: -423.008594 hartree
zpe.sumelectthermalfe: -423.063062 hartree
dipole: -0.0002 -0.5167 -0.0005
dipole: 0.5167
quadrupole: -50.1275 -61.2874 -65.0836
quadrupole: -0.0001 -1.8179 0.0006
quadrupole: 8.7053 -2.4546 -6.2508 -0.0001 -1.8179 0.0006
hfenergy: -423.2488477 hartree
pointgroup: C01 [X(C8H16N2)]
dipole: 0.000063 -0.2032931 0.000191 debye
dipolederiv: -0.6577108 0.0382358 0.031809 -0.0138086 -0.4699603 -0.0133732 0.0397354 -0.008605 -0.5616197 -0.6576936 -0.0382259 0.0318137 0.013837 -0.4699523 0.0133523 0.0397494 0.0085924 -0.5616343 0.5531036 0.1203476 -0.0897587 0.1936556 0.5152307 0.1232258 -0.1311891 0.1094915 0.3895123 0.5530581 -0.1203903 -0.0897208 -0.193725 0.5151724 -0.1232134 -0.1310981 -0.1094942 0.3895992 0.0737907 -0.0957966 -0.0404791 -0.0833184 0.23894 -0.0660689 -0.1100059 -0.0600994 0.4693437 0.5420993 -0.0531473 -0.0540724 -0.1264622 0.1123468 0.0898921 -0.0087503 0.0972476 0.2943517 0.0737595 0.095802 -0.0404237 0.0833035 0.2389706 0.0661066 -0.1099459 0.0601396 0.4693285 0.5420879 0.0531126 -0.0541226 0.1264378 0.1122997 -0.0898611 -0.0088268 -0.0972128 0.2944168 -0.1855248 0.0183776 0.0119075 -0.00797 -0.1790149 -0.0137552 0.0393924 -0.030747 -0.1473763 -0.1855077 -0.0183708 0.0118199 0.007987 -0.1790044 0.013745 0.0391656 0.0307345 -0.1473759 -0.0417505 0.0525374 -0.0590545 0.0014449 -0.0089898 0.0703317 -0.0821886 0.104376 -0.0298276 -0.1033677 0.04953 0.1007297 -0.0677836 -0.0886633 -0.0686758 0.0672334 -0.2161199 -0.1281194 -0.1033569 -0.0494629 0.1007226 0.0678212 -0.0885907 0.0686543 0.0672127 0.2161163 -0.1282093 -0.0417631 -0.0525721 -0.0590558 -0.0014867 -0.0090324 -0.0703365 -0.0821898 -0.1043691 -0.0297644 0.0150981 0.0291634 0.1357205 0.0751762 -0.0045119 -0.1130374 0.0681351 0.0471438 -0.2772075 0.057302 -0.1252564 0.0034414 -0.0972264 -0.1446356 -0.0070092 -0.0256932 -0.0433518 0.0523225 -0.1194884 0.0589247 -0.0411069 0.0541855 0.1248818 -0.0069916 -0.0359349 0.0104061 0.0654735 -0.0076173 -0.0610456 -0.0115091 -0.1435912 -0.1271278 -0.0546501 0.0111975 -0.0322981 0.1000149 -0.1780183 0.0343544 0.0375734 0.1306307 0.0158704 -0.0993203 0.2312455 -0.1120523 -0.145247 0.0520797 0.0233912 -0.0251513 0.1044535 0.0156283 0.1450045 -0.063103 0.1152886 -0.0816219 -0.1194967 -0.0589388 -0.0410562 -0.0541941 0.1248835 0.0069795 -0.0358824 -0.0104098 0.06548 0.0151385 -0.0291405 0.1356651 -0.0751375 -0.0044959 0.1129827 0.0680954 -0.0472053 -0.2772584 0.0572989 0.1252646 0.0034053 0.0972204 -0.1446242 0.007044 -0.0257174 0.0433757 0.0523149 -0.0076132 0.0610479 -0.0115071 0.1436044 -0.1271099 0.0546794 0.0111844 0.0323392 0.0999942 -0.177967 -0.0343217 0.0375832 -0.1305554 0.0159217 0.0993051 0.2312843 0.1120196 -0.1453484 0.0520598 -0.0234203 -0.0251729 -0.1044988 0.0155676 -0.1450102 -0.063106 -0.1153061 -0.0815423 unknown
polarizability: 139.6399609|0.0002196|88.361486|1.1951622|-0.0008393|77.4257377 unknown
InChI: InChI=1S/C8H16N2/c1-9(2)7-5-6-8-10(3)4/h7-8H2,1-4H3
charge 0 multiplicity 1
26 atoms
N  2.671757 0.38632 0.134546
N  -2.671767 0.386331 -0.134507
C  2.092026 -0.977751 -0.003491
C  -2.092028 -0.977715 0.003757
C  2.28049 1.286143 -0.970408
C  4.135421 0.32215 0.316178
C  -2.280274 1.286425 0.970146
C  -4.135466 0.322131 -0.315834
C  0.616622 -0.978328 0.000608
C  -0.616625 -0.978319 -0.000672
H  2.459115 -1.585393 0.847039
H  2.450665 -1.485688 -0.939467
H  -2.450499 -1.485423 0.939924
H  -2.459291 -1.585553 -0.846556
H  2.67189 0.955318 -1.9669
H  2.664799 2.301572 -0.768273
H  1.180504 1.33583 -1.033399
H  4.528482 1.340025 0.485642
H  4.677476 -0.112944 -0.563587
H  4.377376 -0.289197 1.20451
H  -1.180275 1.33612 1.032903
H  -2.671475 0.955846 1.966798
H  -2.664618 2.301806 0.767838
H  -4.528551 1.33997 -0.485462
H  -4.677351 -0.112748 0.564142
H  -4.377603 -0.289426 -1.203973
