program: Orca
programVersion: 5.0.2
elementType: Cl F F F F F F F O O N N C C C C C C C C C C C C C C C H H H H H H H H
charge: 0
multiplicity: 1
keywords: wb97x-d3
keywords: def2-TZVPP
keywords: def2/J RIJCOSX
keywords: DEFGRID2
keywords: scfconv7
keywords: smallprint printgap noloewdin
keywords: NOSOSCF
formula: C15H8ClF7N2O2
InChI: InChI=1/C15H8ClF7N2O2/c1-27-13-11(19)9(17)8(10(18)12(13)20)14(26)25-4-7-6(16)2-5(3-24-7)15(21,22)23/h2-3,25H,4H2,1H3
35 atoms
Cl 1.426068 0.247048 -2.003446
F  -3.625122 2.890694 -0.496416
F  -0.999107 -0.968249 0.073428
F  -3.137308 -2.42139 0.405316
F  -5.822137 1.419145 -0.182409
F  4.997279 -2.869125 0.285004
F  6.466417 -1.327824 0.002168
F  5.77944 -1.803871 1.983589
O  -5.761369 -1.135201 0.246227
O  -0.957152 2.567749 -1.462621
N  -0.035209 1.743069 0.436544
N  3.181057 1.289864 1.37685
C  1.283703 2.316152 0.288781
C  2.348895 1.255224 0.344663
C  -2.224754 1.020025 -0.205994
C  -1.008232 1.84835 -0.476731
C  2.468382 0.266787 -0.632549
C  4.293666 -0.651786 0.572789
C  -3.491377 1.585749 -0.283412
C  -2.172631 -0.342054 0.024543
C  3.445338 -0.701084 -0.522273
C  -4.577081 -0.544707 0.118549
C  -3.309587 -1.1154 0.189627
C  -4.627763 0.83348 -0.116409
C  4.129884 0.371558 1.491544
C  5.384723 -1.664897 0.716137
C  -5.907621 -2.536231 0.47466
H  1.471136 3.03264 1.087747
H  1.331521 2.860537 -0.653101
H  -0.19186 1.173794 1.255663
H  3.537378 -1.46885 -1.279351
H  4.773902 0.462852 2.356835
H  -5.494926 -3.125491 -0.342904
H  -6.980268 -2.704462 0.516736
H  -5.469345 -2.839773 1.424172
elementType: Cl F O N C H
totalener: -1995.66780919 hartree
nucrepener: 2713.16887324 hartree
electener: -4708.83668244 hartree
oneelecener: -8147.73728214 hartree
twoeener: 3438.90059970 hartree
cpcmener: -0.03910569 hartree
kineticenergy: 1989.58392141 hartree
xcener: -153.565767422637 hartree
chargesum: 0.0000000
charge: -0.061873 -0.192738 -0.195000 -0.203879 -0.197862 -0.178054 -0.176942 -0.176938 -0.305329 -0.517873 -0.164757 -0.346976 -0.053894 0.226736 -0.142422 0.362410 -0.010976 -0.059923 0.228516 0.226745 -0.091848 0.165258 0.197252 0.134481 0.021094 0.555104 -0.128537 0.109549 0.134329 0.186950 0.140717 0.137901 0.126958 0.124718 0.127103
qa: -0.0619 -0.1927 -0.1950 -0.2039 -0.1979 -0.1781 -0.1769 -0.1769 -0.3053 -0.5179 -0.1648 -0.3470 -0.0539 0.2267 -0.1424 0.3624 -0.0110 -0.0599 0.2285 0.2267 -0.0918 0.1653 0.1973 0.1345 0.0211 0.5551 -0.1285 0.1095 0.1343 0.1870 0.1407 0.1379 0.1270 0.1247 0.1271
va: 1.2615 1.1105 1.1035 1.0843 1.0954 1.1244 1.1144 1.1282 2.0771 1.9754 3.2043 3.0866 3.8573 3.7325 3.5507 4.1695 3.9879 3.7033 3.9938 3.9917 4.0606 3.9030 3.9138 3.9878 4.0716 4.4199 3.8379 1.0251 1.0214 1.0006 1.0210 1.0119 0.9889 0.9918 0.9887
dispcorr: -0.017194163 hartree
energy: -1995.685003356362
dipole: -11.97372 11.87830 -0.09542 1.96506 -4.00247 -2.03741 4.86005 -3.21193 1.64812
magnitude: 2.62230 au
magnitude: 6.66535 debye
