program: Orca
programVersion: 5.0.2
elementType: Cl F F F F F F F O O N N C C C C C C C C C C C C C C C H H H H H H H H
charge: 0
multiplicity: 1
keywords: wb97x-d3
keywords: def2-TZVPP
keywords: def2/J RIJCOSX
keywords: DEFGRID2
keywords: scfconv7
keywords: smallprint printgap noloewdin
keywords: NOSOSCF
formula: C15H8ClF7N2O2
InChI: InChI=1/C15H8ClF7N2O2/c1-27-13-11(19)9(17)8(10(18)12(13)20)14(26)25-4-7-6(16)2-5(3-24-7)15(21,22)23/h2-3,25H,4H2,1H3
35 atoms
Cl 3.932882 2.852966 0.885823
F  -1.276795 -0.989239 -0.878619
F  -3.632606 2.472512 1.226685
F  -5.895915 1.057934 0.992564
F  -3.476061 -2.379648 -1.166997
F  4.436685 -2.875043 -1.601898
F  5.944667 -1.339771 -1.693442
F  5.683131 -2.486243 0.103185
O  -5.984493 -1.274953 -0.153835
O  -1.04332 2.624305 -0.406398
N  -0.209671 1.16936 1.122549
N  1.807718 -0.410895 0.283582
C  1.113317 1.725984 1.203845
C  2.162195 0.819261 0.612288
C  -2.380578 0.772747 0.203451
C  -1.137724 1.610436 0.267829
C  3.479873 1.247416 0.446049
C  4.030958 -0.899616 -0.401081
C  -2.401117 -0.469915 -0.392733
C  -3.592327 1.274872 0.647721
C  4.4293 0.387091 -0.065914
C  -4.78199 -0.707527 -0.080198
C  -4.754766 0.552948 0.527048
C  -3.566481 -1.201464 -0.54516
C  2.706135 -1.250704 -0.208058
C  5.023233 -1.899089 -0.904238
C  -6.165434 -2.633146 -0.554409
H  1.363736 1.919107 2.250312
H  1.119933 2.693743 0.705286
H  -0.372075 0.289041 1.588481
H  5.450892 0.719793 -0.197548
H  2.342276 -2.240737 -0.452436
H  -7.22023 -2.839128 -0.39411
H  -5.579925 -3.318815 0.057676
H  -5.939607 -2.777975 -1.609837
elementType: Cl F O N C H
totalener: -1995.66788598 hartree
nucrepener: 2656.16663162 hartree
electener: -4651.83451760 hartree
oneelecener: -8033.98016771 hartree
twoeener: 3382.14565011 hartree
cpcmener: -0.03772686 hartree
kineticenergy: 1989.57952486 hartree
xcener: -153.565195194674 hartree
chargesum: -0.0000000
charge: -0.066266 -0.194766 -0.195789 -0.198261 -0.204302 -0.177798 -0.178212 -0.177807 -0.311438 -0.526321 -0.161273 -0.374311 -0.073352 0.300899 -0.130246 0.377621 -0.031077 -0.065963 0.235662 0.249537 -0.077567 0.163708 0.115664 0.180856 0.005642 0.554378 -0.125803 0.141613 0.110031 0.182514 0.141260 0.135482 0.124625 0.128042 0.123017
qa: -0.0663 -0.1948 -0.1958 -0.1983 -0.2043 -0.1778 -0.1782 -0.1778 -0.3114 -0.5263 -0.1613 -0.3743 -0.0734 0.3009 -0.1302 0.3776 -0.0311 -0.0660 0.2357 0.2495 -0.0776 0.1637 0.1157 0.1809 0.0056 0.5544 -0.1258 0.1416 0.1100 0.1825 0.1413 0.1355 0.1246 0.1280 0.1230
va: 1.2535 1.1037 1.1080 1.0950 1.0836 1.1263 1.1244 1.1124 2.0681 1.9833 3.2381 3.0311 3.9022 3.6505 3.5500 4.1647 4.0820 3.7230 4.0033 3.9888 4.0657 3.8893 4.0088 3.9250 4.1106 4.4213 3.8379 0.9911 1.0338 1.0091 1.0191 1.0116 0.9919 0.9890 0.9890
dispcorr: -0.016357286 hartree
energy: -1995.684243268055
dipole: -15.31189 15.63455 0.32265 -2.96069 0.85310 -2.10759 3.43185 -2.21895 1.21290
magnitude: 2.45299 au
magnitude: 6.23500 debye
