program: Gaussian 09
title: 000066071
version: EM64L-G09RevD.01
frameworkgroup: C1[X(C4H12N2)]
method: RPBEPBE
basis: SDD
operation: Freq
keyword: #pfreq=noraman
keyword: PBEPBE/SDD
title: #p freq=noraman PBEPBE/SDD
converged: YES YES NO NO
title: Mulliken charges:
elementType: N N C C C C H H H H H H H H H H H H
charge: -0.290323 -0.582020 -0.328312 -0.317628 -0.386399 -0.689723 0.229855 0.163253 0.235897 0.211344 0.176313 0.166729 0.228442 0.200914 0.232162 0.210607 0.261015 0.277871
chargesum: 0.00000
title: Mulliken charges with hydrogens summed into heavy atoms:
elementType: N N C C C C
charge: -0.054425 -0.043134 0.064797 0.070030 0.008772 -0.046039
polarizability: 7.47068349e+01 -7.31177524e-01 5.36298435e+01 8.24876400e-01 5.85532060e-01 4.94089413e+01
1716.lowfreq: -10.0832 -0.0009 -0.0007 -0.0006 7.9678 28.6765 69.8658 103.2597 128.7407
frequency: 69.5105 103.0428 128.7291 159.9251 216.3097 249.8095 317.9946 376.0314 485.9869 580.6294 677.2399 805.1828 818.2218 902.5035 955.1866 1040.7550 1041.9971 1105.8117 1112.0477 1135.9291 1156.5952 1191.6431 1242.1061 1269.9272 1281.6422 1316.7806 1364.7698 1388.0043 1400.1105 1446.8606 1471.9201 1476.7719 1482.3711 1490.3916 1500.1769 1637.8299 2822.5273 2845.7501 2848.3413 2977.7066 2999.7740 3029.3329 3051.3747 3069.9954 3092.0189 3418.3059 3470.1785 3599.2271
redmass: 3.1349 1.6204 2.9473 2.4184 1.1315 1.1347 2.6762 3.6786 2.6843 1.3114 1.3382 1.0917 1.1214 1.7230 1.5998 1.9382 2.7204 2.1212 2.0093 1.7836 2.9155 1.7740 1.3075 1.1972 1.1046 1.2663 1.3536 1.2504 1.5017 1.1928 1.0593 1.0697 1.0520 1.0917 1.0855 1.0958 1.0721 1.0720 1.0721 1.0374 1.0861 1.0843 1.0906 1.0978 1.1002 1.0737 1.0449 1.0980
irintensity: 0.5958 4.5412 0.7256 1.6026 51.1280 1.0187 14.6278 0.5124 15.9038 252.2136 96.2457 2.0037 3.7974 2.2416 1.6002 13.2708 8.3374 34.3586 3.2798 8.7034 52.4881 3.5993 1.8946 3.3762 9.5595 11.5414 2.9631 13.5339 13.2857 28.8882 16.8253 3.8534 3.2278 3.9976 4.4373 44.5797 117.1061 132.5225 153.5920 31.3573 29.6982 24.3704 49.3362 60.5536 39.4500 3.5559 0.6870 0.5483
temp: 298.150 k
press: 1.00000 atm
elementType: 7 7 6 6 6 6 1 1 1 1 1 1 1 1 1 1 1 1
symmnumber: 1
zpe: 428414.3 jmol-1
zpe.correction: 0.163174 hartree
zpe.thermalcorrener: 0.171645 hartree
zpe.thermalcorrenthalpy: 0.172589 hartree
zpe.thermalcorrgfe: 0.130543 hartree
zpe.sumelectzpe: -268.570932 hartree
zpe.sumelectthermal: -268.562461 hartree
zpe.sumelectthermalent: -268.561517 hartree
zpe.sumelectthermalfe: -268.603563 hartree
dipole: -0.3649 -0.3459 1.7716
dipole: 1.8416
quadrupole: -34.5208 -40.1614 -38.9768
quadrupole: 3.3568 -2.2222 0.0366
quadrupole: 3.3655 -2.2751 -1.0905 3.3568 -2.2222 0.0366
hfenergy: -268.7341062 hartree
pointgroup: C01 [X(C4H12N2)]
dipole: -0.1313371 0.1340264 -0.6998059 debye
dipolederiv: -0.8484128 0.0258623 -0.0290919 0.039585 -0.5015062 -0.2096033 -0.0233551 -0.2498972 -0.2768376 -0.6761084 -0.1309806 0.009472 -0.1650399 -0.5516649 0.2847039 0.0120838 0.2632983 -0.4414971 0.4120884 0.1667805 0.0408672 0.3088795 0.2610569 0.1255226 -0.0391594 0.1421923 0.3415554 0.498375 -0.1854429 -0.0151641 -0.2886965 0.3674819 0.0972011 0.0886134 0.0919558 0.3423394 0.5191872 0.1965611 -0.0447004 0.1391396 0.3234673 -0.1440722 0.0136928 -0.1322386 0.3184401 -0.1192112 -0.0481261 -0.0143553 -0.0387542 0.038011 -0.0125242 0.0045433 -0.0329215 0.0893672 0.0510726 0.0045999 -0.0234169 -0.0339517 -0.0347653 0.0992881 -0.0038077 0.113107 -0.081085 -0.0915572 -0.0351229 -0.0153667 -0.1227935 -0.1208508 -0.1548149 -0.1033734 -0.1996843 -0.1628526 0.1217285 0.0054717 0.001456 -0.0074343 0.1714492 0.1076849 0.0097677 0.2152231 0.0378853 0.0208521 -0.0225935 0.0431529 0.0320815 -0.0315902 0.1058764 -0.0001477 0.1319388 -0.1117445 -0.0763943 0.0048616 -0.018329 0.1171187 -0.1651758 -0.1561035 0.0590822 -0.210008 -0.1291032 -0.0868244 -0.1009707 0.0508136 -0.0844718 -0.1528582 0.1530938 0.0814433 0.2128683 -0.1312726 0.0483769 -0.0171642 0.0076026 -0.0257929 -0.0123967 -0.0956661 0.0202848 -0.1214713 -0.0900298 0.0769782 0.0003738 -0.0170037 -0.0501829 0.0024131 0.1175116 0.0271219 0.1386495 -0.1183904 0.1041775 0.003914 0.0190372 -0.0499245 -0.025511 -0.1213538 -0.0244748 -0.1273924 -0.0497893 -0.1404693 0.098901 -0.0137122 0.1423656 0.0023143 0.0135778 -0.0120116 0.0125487 0.1045115 0.1645479 -0.027059 0.0133683 -0.0417896 0.2714252 -0.1030092 -0.03078 -0.1677565 0.0564755 0.0215933 0.0601341 0.0053703 0.1296619 0.1587002 -0.1073131 -0.0795235 -0.0804118 0.3020276 unknown
polarizability: 74.7320968|0.6483117|53.6294244|-0.3982713|0.5839773|49.3840985 unknown
InChI: InChI=1S/C4H12N2/c1-2-6-4-3-5/h6H,2-5H2,1H3
charge 0 multiplicity 1
18 atoms
N  0.63608 0.299048 -0.042479
N  -3.11083 -0.183174 -0.093231
C  -0.647666 -0.431033 -0.043094
C  1.840106 -0.557793 0.012471
C  -1.834592 0.551398 -0.026623
C  3.121939 0.292867 -0.008207
H  -0.701609 -1.061945 0.863272
H  -0.75745 -1.123483 -0.920581
H  0.690112 0.967056 -0.8257
H  1.798113 -1.141691 0.953155
H  1.875556 -1.304979 -0.822097
H  -1.694368 1.294736 -0.8539
H  -1.800549 1.121289 0.918973
H  3.201255 0.872962 -0.948159
H  3.120911 1.005931 0.834692
H  4.020228 -0.346111 0.068693
H  -3.253672 -0.70697 -0.961664
H  -3.935564 0.35919 0.175081
