program: Orca
programVersion: 5.0.2
elementType: Cl F F F F F F F O O N N C C C C C C C C C C C C C C C H H H H H H H H
charge: 0
multiplicity: 1
keywords: wb97x-d3
keywords: def2-TZVPP
keywords: def2/J RIJCOSX
keywords: DEFGRID2
keywords: scfconv7
keywords: smallprint printgap noloewdin
keywords: NOSOSCF
formula: C15H8ClF7N2O2
InChI: InChI=1/C15H8ClF7N2O2/c1-27-13-11(19)9(17)8(10(18)12(13)20)14(26)25-4-7-6(16)2-5(3-24-7)15(21,22)23/h2-3,25H,4H2,1H3
35 atoms
Cl 3.802475 2.990806 -0.454127
F  -3.612352 1.778406 -1.962907
F  -1.644772 -0.55567 1.613446
F  -3.896465 -1.946483 1.919086
F  -5.826326 0.427038 -1.678597
F  5.145333 -2.895529 1.174803
F  6.002622 -2.252994 -0.687262
F  6.523699 -1.241815 1.135828
O  -5.992346 -1.582828 0.437036
O  -1.464316 2.75679 -0.432329
N  -0.157643 0.92467 -0.395455
N  2.041751 -0.502891 0.008752
C  1.070182 1.673299 -0.454318
C  2.252323 0.786123 -0.198772
C  -2.540777 0.664951 -0.19265
C  -1.3382 1.541952 -0.343596
C  3.544977 1.308983 -0.182108
C  4.373705 -0.867375 0.271228
C  -3.653402 0.875307 -0.988338
C  -2.659743 -0.311621 0.786972
C  4.621295 0.480801 0.05283
C  -4.943339 -0.818303 0.150614
C  -3.819949 -1.029244 0.955158
C  -4.82431 0.154359 -0.839612
C  3.064643 -1.31455 0.23845
C  5.511257 -1.816243 0.479509
C  -7.228312 -1.498881 -0.271674
H  1.058688 2.477481 0.286566
H  1.185863 2.154567 -1.430515
H  -0.080652 -0.079092 -0.302702
H  5.625079 0.884407 0.066548
H  2.815068 -2.355614 0.398302
H  -7.688176 -0.516614 -0.170691
H  -7.874148 -2.234835 0.199337
H  -7.111954 -1.759752 -1.322613
elementType: Cl F O N C H
totalener: -1995.67072640 hartree
nucrepener: 2620.36790437 hartree
electener: -4616.03863077 hartree
oneelecener: -7962.06141928 hartree
twoeener: 3346.02278851 hartree
cpcmener: -0.03471872 hartree
kineticenergy: 1989.57156995 hartree
xcener: -153.567300180241 hartree
chargesum: -0.0000000
charge: -0.061750 -0.191965 -0.197684 -0.198404 -0.203214 -0.176748 -0.176501 -0.177733 -0.304840 -0.539891 -0.178415 -0.379472 -0.062282 0.308789 -0.165111 0.409271 -0.047315 -0.064990 0.238434 0.244981 -0.066674 0.171698 0.127517 0.179330 0.006305 0.552315 -0.128437 0.114676 0.124192 0.186640 0.140336 0.138516 0.126725 0.125307 0.126396
qa: -0.0617 -0.1920 -0.1977 -0.1984 -0.2032 -0.1767 -0.1765 -0.1777 -0.3048 -0.5399 -0.1784 -0.3795 -0.0623 0.3088 -0.1651 0.4093 -0.0473 -0.0650 0.2384 0.2450 -0.0667 0.1717 0.1275 0.1793 0.0063 0.5523 -0.1284 0.1147 0.1242 0.1866 0.1403 0.1385 0.1267 0.1253 0.1264
va: 1.2601 1.1112 1.1017 1.0952 1.0845 1.1278 1.1142 1.1257 2.0776 1.9645 3.2026 3.0371 3.9896 3.6301 3.5801 4.1163 4.1085 3.7205 4.0124 3.9933 4.0529 3.8918 3.9942 3.8958 4.1034 4.4230 3.8380 1.0036 0.9944 1.0363 1.0201 1.0108 0.9889 0.9915 0.9890
dispcorr: -0.015721980 hartree
energy: -1995.686448384865
dipole: -19.02028 19.00298 -0.01730 0.86023 -2.32956 -1.46933 -2.93169 2.56213 -0.36956
magnitude: 1.51519 au
magnitude: 3.85131 debye
