program: Orca
programVersion: 5.0.2
elementType: Cl F F F F F F F O O N N C C C C C C C C C C C C C C C H H H H H H H H
charge: 0
multiplicity: 1
keywords: wb97x-d3
keywords: def2-TZVPP
keywords: def2/J RIJCOSX
keywords: DEFGRID2
keywords: scfconv7
keywords: smallprint printgap noloewdin
keywords: NOSOSCF
formula: C15H8ClF7N2O2
InChI: InChI=1/C15H8ClF7N2O2/c1-27-13-11(19)9(17)8(10(18)12(13)20)14(26)25-4-7-6(16)2-5(3-24-7)15(21,22)23/h2-3,25H,4H2,1H3
35 atoms
Cl 1.594231 -0.792619 -2.359252
F  -2.890199 2.371546 -1.150813
F  -1.465519 -1.192087 1.559623
F  -3.974946 -2.12081 1.630085
F  -5.370526 1.49882 -1.048832
F  6.266479 -1.594129 0.0220
F  6.31667 -0.300563 1.744286
F  5.108312 -2.077988 1.764671
O  -5.955598 -0.904263 0.428266
O  -0.136566 1.392119 1.278056
N  -0.150229 1.401407 -0.974549
N  3.028876 1.666908 0.376272
C  1.154947 2.004614 -1.105712
C  2.273431 1.145391 -0.577088
C  -2.092623 0.614886 0.189689
C  -0.702116 1.17185 0.221991
C  2.539287 -0.130199 -1.07665
C  4.36557 -0.295238 0.429972
C  -3.126715 1.25235 -0.469006
C  -2.416217 -0.523693 0.914885
C  3.591666 -0.864527 -0.571227
C  -4.748314 -0.36377 0.285601
C  -3.702277 -1.010313 0.948171
C  -4.429146 0.790953 -0.421346
C  4.044982 0.977728 0.871015
C  5.517311 -1.062798 0.995217
C  -6.938929 -0.789196 -0.600138
H  1.188602 2.960932 -0.582575
H  1.312204 2.209618 -2.165219
H  -0.639818 1.130934 -1.812311
H  3.803184 -1.852305 -0.961129
H  4.618976 1.469511 1.646288
H  -7.641461 -1.600901 -0.426128
H  -6.504961 -0.911538 -1.59322
H  -7.477441 0.155541 -0.538471
elementType: Cl F O N C H
totalener: -1995.67463049 hartree
nucrepener: 2696.87710059 hartree
electener: -4692.55173108 hartree
oneelecener: -8115.70336568 hartree
twoeener: 3423.15163460 hartree
cpcmener: -0.03500862 hartree
kineticenergy: 1989.60352421 hartree
xcener: -153.565711563083 hartree
chargesum: -0.0000000
charge: -0.065942 -0.196259 -0.190427 -0.193731 -0.202194 -0.178434 -0.175959 -0.175843 -0.312689 -0.484894 -0.195439 -0.337797 -0.075069 0.229575 -0.177477 0.408508 -0.025599 -0.070978 0.261924 0.237238 -0.090019 0.149989 0.126858 0.172320 0.020806 0.553889 -0.115439 0.114776 0.151321 0.192318 0.141728 0.136174 0.123145 0.125667 0.117953
qa: -0.0659 -0.1963 -0.1904 -0.1937 -0.2022 -0.1784 -0.1760 -0.1758 -0.3127 -0.4849 -0.1954 -0.3378 -0.0751 0.2296 -0.1775 0.4085 -0.0256 -0.0710 0.2619 0.2372 -0.0900 0.1500 0.1269 0.1723 0.0208 0.5539 -0.1154 0.1148 0.1513 0.1923 0.1417 0.1362 0.1231 0.1257 0.1180
va: 1.2538 1.1037 1.1140 1.1021 1.0878 1.1215 1.1306 1.1192 2.0632 2.0367 3.1717 3.0545 3.8556 3.7042 3.5530 4.1309 4.0026 3.7216 3.9815 3.9882 4.0631 3.8856 4.0205 3.9144 4.0726 4.4279 3.8332 1.0328 0.9910 0.9992 1.0195 1.0115 0.9923 0.9896 0.9890
dispcorr: -0.016993680 hartree
energy: -1995.691624170178
dipole: -16.54556 15.08162 -1.46394 7.59146 -7.73522 -0.14376 -7.02518 4.02689 -2.99828
magnitude: 3.33969 au
magnitude: 8.48881 debye
