program: Orca
programVersion: 5.0.2
elementType: Cl F F F F F F F O O N N C C C C C C C C C C C C C C C H H H H H H H H
charge: 0
multiplicity: 1
keywords: wb97x-d3
keywords: def2-TZVPP
keywords: def2/J RIJCOSX
keywords: DEFGRID2
keywords: scfconv7
keywords: smallprint printgap noloewdin
keywords: NOSOSCF
formula: C15H8ClF7N2O2
InChI: InChI=1/C15H8ClF7N2O2/c1-27-13-11(19)9(17)8(10(18)12(13)20)14(26)25-4-7-6(16)2-5(3-24-7)15(21,22)23/h2-3,25H,4H2,1H3
35 atoms
Cl 1.923026 2.418136 -0.729341
F  -1.346085 -1.376168 -1.15497
F  -2.942775 1.429752 2.253891
F  -5.386133 1.319816 1.243677
F  -3.808842 -1.460612 -2.222067
F  5.688168 -2.592685 -0.221571
F  4.759687 -1.980095 -2.061318
F  6.324824 -0.78557 -1.205183
O  -5.846064 -0.208945 -1.140784
O  -0.262284 -1.097462 1.591376
N  -0.097488 1.143288 1.374866
N  2.909906 -0.437186 1.808232
C  1.186898 1.242568 2.031259
C  2.29311 0.588228 1.244127
C  -2.072705 0.034531 0.578666
C  -0.723669 -0.030038 1.229982
C  2.661013 1.02504 -0.029135
C  4.231586 -0.750444 -0.139994
C  -2.334244 -0.713482 -0.559766
C  -3.130425 0.722231 1.140564
C  3.631162 0.348165 -0.738296
C  -4.664694 -0.063154 -0.544081
C  -4.406259 0.671994 0.608741
C  -3.591992 -0.751482 -1.116135
C  3.853148 -1.091226 1.148129
C  5.254934 -1.530915 -0.901848
C  -6.780515 0.869295 -1.179306
H  1.148336 0.776011 3.015797
H  1.397291 2.301614 2.180151
H  -0.5190 1.980308 1.003287
H  3.9082 0.673569 -1.733335
H  4.309875 -1.920435 1.67338
H  -6.28731 1.828113 -1.34741
H  -7.385613 0.912872 -0.274393
H  -7.435163 0.663146 -2.023476
elementType: Cl F O N C H
totalener: -1995.67463640 hartree
nucrepener: 2701.89866330 hartree
electener: -4697.57329970 hartree
oneelecener: -8125.74572025 hartree
twoeener: 3428.17242054 hartree
cpcmener: -0.03493426 hartree
kineticenergy: 1989.58122164 hartree
xcener: -153.560797110304 hartree
chargesum: 0.0000000
charge: -0.065055 -0.192318 -0.196463 -0.202016 -0.193593 -0.175334 -0.177573 -0.178100 -0.317472 -0.481307 -0.195343 -0.335265 -0.074883 0.223980 -0.178371 0.404735 -0.023213 -0.071433 0.241791 0.266484 -0.092273 0.144969 0.173629 0.124108 0.021420 0.556784 -0.113529 0.113753 0.152909 0.194636 0.141933 0.137025 0.125681 0.116876 0.122832
qa: -0.0651 -0.1923 -0.1965 -0.2020 -0.1936 -0.1753 -0.1776 -0.1781 -0.3175 -0.4813 -0.1953 -0.3353 -0.0749 0.2240 -0.1784 0.4047 -0.0232 -0.0714 0.2418 0.2665 -0.0923 0.1450 0.1736 0.1241 0.0214 0.5568 -0.1135 0.1138 0.1529 0.1946 0.1419 0.1370 0.1257 0.1169 0.1228
va: 1.2549 1.1120 1.1036 1.0890 1.1028 1.1318 1.1210 1.1198 2.0556 2.0410 3.1686 3.0556 3.8556 3.7078 3.5666 4.1366 4.0057 3.7213 3.9790 3.9808 4.0674 3.8752 3.9162 4.0339 4.0645 4.4260 3.8313 1.0336 0.9919 0.9981 1.0185 1.0112 0.9895 0.9893 0.9926
dispcorr: -0.017043040 hartree
energy: -1995.691679442757
dipole: -15.89074 14.75493 -1.13582 8.54367 -5.48488 3.05879 6.46157 -6.90847 -0.44690
magnitude: 3.29333 au
magnitude: 8.37097 debye
