program: Orca
programVersion: 5.0.2
elementType: Cl F F F F F F F O O N N C C C C C C C C C C C C C C C H H H H H H H H
charge: 0
multiplicity: 1
keywords: wb97x-d3
keywords: def2-TZVPP
keywords: def2/J RIJCOSX
keywords: DEFGRID2
keywords: scfconv7
keywords: smallprint printgap noloewdin
keywords: NOSOSCF
formula: C15H8ClF7N2O2
InChI: InChI=1/C15H8ClF7N2O2/c1-27-13-11(19)9(17)8(10(18)12(13)20)14(26)25-4-7-6(16)2-5(3-24-7)15(21,22)23/h2-3,25H,4H2,1H3
35 atoms
Cl 1.498159 1.732774 1.127116
F  -3.629167 2.03026 -1.945234
F  -0.997751 -0.719735 0.81654
F  -3.201257 -1.9274 1.689426
F  -5.808268 0.833732 -1.117944
F  6.664113 -0.760189 0.792287
F  5.291603 -1.75747 2.109841
F  5.821617 -2.654567 0.228305
O  -5.589706 -1.300696 0.835913
O  -0.984323 2.667298 -0.991224
N  -0.023394 0.686407 -1.531931
N  3.196841 -0.270613 -1.818172
C  1.275812 1.188194 -1.914087
C  2.37666 0.516189 -1.135387
C  -2.231823 0.695863 -0.607979
C  -1.018915 1.452211 -1.060915
C  2.5419 0.691061 0.238464
C  4.401294 -0.78455 0.166039
C  -3.492944 1.064904 -1.041615
C  -2.17194 -0.330697 0.32442
C  3.564135 0.039857 0.901215
C  -4.580825 -0.595052 0.334772
C  -3.308005 -0.95522 0.784676
C  -4.642775 0.433305 -0.603544
C  4.180816 -0.902175 -1.1982
C  5.544105 -1.493029 0.825402
C  -6.935824 -0.829765 0.81313
H  1.296448 2.266947 -1.76214
H  1.451465 1.003318 -2.97436
H  -0.183587 -0.303264 -1.653285
H  3.694777 0.179251 1.966363
H  4.811419 -1.52579 -1.820616
H  -7.015656 0.194555 1.17871
H  -7.478992 -1.483028 1.491893
H  -7.379862 -0.914448 -0.177898
elementType: Cl F O N C H
totalener: -1995.67441927 hartree
nucrepener: 2700.42772726 hartree
electener: -4696.10214653 hartree
oneelecener: -8122.44040945 hartree
twoeener: 3426.33826292 hartree
cpcmener: -0.03165185 hartree
kineticenergy: 1989.56527867 hartree
xcener: -153.560227232153 hartree
chargesum: 0.0000000
charge: -0.058448 -0.189704 -0.194338 -0.195798 -0.202611 -0.175254 -0.176491 -0.176386 -0.304830 -0.479851 -0.173876 -0.340378 -0.061547 0.221350 -0.150917 0.362405 -0.008284 -0.062656 0.230751 0.230880 -0.092037 0.150501 0.145171 0.181297 0.016400 0.553382 -0.123050 0.135199 0.111772 0.182007 0.137862 0.136047 0.128871 0.123476 0.119086
qa: -0.0584 -0.1897 -0.1943 -0.1958 -0.2026 -0.1753 -0.1765 -0.1764 -0.3048 -0.4799 -0.1739 -0.3404 -0.0615 0.2213 -0.1509 0.3624 -0.0083 -0.0627 0.2308 0.2309 -0.0920 0.1505 0.1452 0.1813 0.0164 0.5534 -0.1230 0.1352 0.1118 0.1820 0.1379 0.1360 0.1289 0.1235 0.1191
va: 1.2640 1.1152 1.1038 1.0992 1.0858 1.1160 1.1269 1.1275 2.0741 2.0243 3.1881 3.0869 3.8591 3.7331 3.5512 4.1736 3.9969 3.7067 4.0048 3.9683 4.0527 3.9027 4.0205 3.8944 4.0837 4.4205 3.8387 1.0212 1.0241 1.0035 1.0222 1.0120 0.9887 0.9919 0.9892
dispcorr: -0.017092697 hartree
energy: -1995.691511970477
dipole: -16.05916 15.18777 -0.87139 1.73938 -3.09052 -1.35114 -7.43882 7.27234 -0.16649
magnitude: 1.61636 au
magnitude: 4.10846 debye
