program: Gaussian 09
title: 000066059
version: EM64L-G09RevD.01
frameworkgroup: C1[X(C4H7N)]
method: RPBEPBE
basis: SDD
operation: Freq
keyword: #p
keyword: freq=noraman
keyword: PBEPBE/SDD
title: #p freq=noraman PBEPBE/SDD
converged: NO NO NO NO
title: Mulliken charges:
elementType: N C C C C H H H H H H H
charge: -0.322480 -0.423362 -0.423363 -0.210670 -0.210667 0.205630 0.222428 0.222426 0.205630 0.265760 0.234334 0.234333
chargesum: 0.00000
title: Mulliken charges with hydrogens summed into heavy atoms:
elementType: N C C C C
charge: -0.056720 0.004696 0.004693 0.023664 0.023666
polarizability: 5.95488790e+01 1.78117866e-04 4.50939939e+01 -6.12453643e-05 1.20964207e+00 3.20551769e+01
1716.lowfreq: -29.6828 -20.5548 -14.9619 -0.0007 -0.0005 0.0002 20.9723 382.0551 568.3129
frequency: -29.1248 382.0546 568.3080 674.9033 739.6223 783.7717 889.3644 906.4782 929.8651 964.6211 999.4883 1026.5093 1094.5002 1095.8490 1157.2027 1180.1129 1285.9127 1310.5210 1329.3571 1413.7763 1479.1698 1486.5811 1632.8685 2939.7612 2944.2417 2981.5366 2984.4126 3151.0464 3185.5768 3486.8127
redmass: 1.6486 2.0568 1.9140 1.1593 2.8118 5.7025 2.0527 2.0091 1.1754 3.1069 1.7110 1.6991 5.0671 1.1081 1.0906 1.1713 1.2273 1.6750 1.5387 1.1882 1.0803 1.0919 6.0194 1.0605 1.0625 1.0996 1.1018 1.0862 1.1082 1.0766
irintensity: 14.0112 0.0096 129.4548 65.0241 11.5412 0.0055 2.1576 7.5438 0.9519 5.7653 0.0403 13.5053 24.0237 0.8771 2.0657 1.9105 0.4592 0.2728 1.6909 14.7008 2.1186 4.4001 0.8287 145.8041 20.7605 11.9002 85.3257 5.6482 22.2075 0.0533
temp: 298.150 k
press: 1.00000 atm
elementType: 7 6 6 6 6 1 1 1 1 1 1 1
symmnumber: 1
zpe: 269185.0 jmol-1
zpe.correction: 0.102527 hartree
zpe.thermalcorrener: 0.106581 hartree
zpe.thermalcorrenthalpy: 0.107525 hartree
zpe.thermalcorrgfe: 0.075779 hartree
zpe.sumelectzpe: -210.937812 hartree
zpe.sumelectthermal: -210.933759 hartree
zpe.sumelectthermalent: -210.932814 hartree
zpe.sumelectthermalfe: -210.964560 hartree
dipole: 0.0000 0.6882 -1.2667
dipole: 1.4415
quadrupole: -27.4247 -31.2559 -31.9055
quadrupole: 0.0000 0.0000 3.0793
quadrupole: 2.7707 -1.0605 -1.7101 0.0000 0.0000 3.0793
hfenergy: -211.0403392 hartree
pointgroup: C01 [X(C4H7N1)]
dipole: 0.2968766 0.0002374 0.4832392 debye
dipolederiv: -0.6708258 -0.0001487 -0.0405851 -0.000151 -0.4767563 -0.0000365 -0.2561432 -0.0002042 -0.2424007 0.201238 0.1414631 -0.0156155 0.0980532 0.3086966 -0.0774789 0.0013133 -0.0613767 0.3596457 0.2016219 -0.1416501 -0.0157426 -0.0982339 0.3083164 0.0774568 0.001212 0.0613805 0.3596506 0.0286442 -0.0823631 -0.0049974 -0.0475221 0.0067448 -0.014307 -0.0119615 -0.0392805 -0.2697659 0.0284352 0.0824029 -0.0050172 0.0475579 0.0069673 0.0143019 -0.0120212 0.0392616 -0.2697616 0.0381846 0.0521127 0.0349768 0.0041414 -0.0879432 -0.1163399 0.0604705 -0.1701361 -0.062553 0.0162793 0.0405557 -0.0286462 -0.0145428 -0.0720114 0.1180686 -0.0219392 0.1789668 -0.1157981 0.0163193 -0.0404132 -0.0284566 0.014687 -0.0720531 -0.1181183 -0.0216515 -0.1790066 -0.1158065 0.0382758 -0.0519068 0.0347876 -0.0039391 -0.0880407 0.1163993 0.060198 0.1702358 -0.0625494 0.2520375 0.000117 0.0618973 0.0001182 0.1037471 0.0000496 0.182853 0.0001449 0.0416478 -0.0749583 -0.0920031 0.0036943 -0.0922325 0.0310193 0.0063293 0.0088287 0.0072033 0.188846 -0.0752516 0.0918336 0.0037047 0.0920636 0.0313134 -0.0063249 0.008841 -0.0071888 0.1888451 unknown
polarizability: 44.9286759|-0.0116546|59.5488698|-1.895144|-0.0013126|32.2205042 unknown
InChI: InChI=1S/C4H7N/c1-2-4-5-3-1/h1-2,5H,3-4H2
charge 0 multiplicity 1
12 atoms
N  -1.255031 -0.001006 0.078728
C  -0.386873 1.219812 -0.01907
C  -0.384922 -1.220419 -0.019083
C  1.03745 0.678984 0.024014
C  1.038531 -0.677326 0.024004
H  -0.597348 1.93225 0.80561
H  -0.567106 1.767023 -0.968567
H  -0.564274 -1.767915 -0.968585
H  -0.594245 -1.933218 0.80558
H  -1.816755 -0.001458 0.937274
H  1.922682 1.321829 0.008204
H  1.924793 -1.318753 0.008191
