program: Orca
programVersion: 5.0.2
elementType: Cl F F F F F F F O O N N C C C C C C C C C C C C C C C H H H H H H H H
charge: 0
multiplicity: 1
keywords: wb97x-d3
keywords: def2-TZVPP
keywords: def2/J RIJCOSX
keywords: DEFGRID2
keywords: scfconv7
keywords: smallprint printgap noloewdin
keywords: NOSOSCF
formula: C15H8ClF7N2O2
InChI: InChI=1/C15H8ClF7N2O2/c1-27-13-11(19)9(17)8(10(18)12(13)20)14(26)25-4-7-6(16)2-5(3-24-7)15(21,22)23/h2-3,25H,4H2,1H3
35 atoms
Cl 3.779411 3.077957 0.105483
F  -2.618517 0.542966 -2.024108
F  -2.517827 0.594059 2.658719
F  -4.608237 -1.110402 2.728801
F  -4.704609 -1.167929 -1.965536
F  5.031452 -2.992215 -0.764661
F  6.370433 -1.347592 -1.157761
F  6.083414 -2.044591 0.854126
O  -5.71228 -2.054422 0.419813
O  -1.582576 2.779964 0.224475
N  -0.182609 1.007597 0.323376
N  2.003713 -0.434185 0.13389
C  1.026069 1.778203 0.282289
C  2.216782 0.86943 0.156425
C  -2.527922 0.597029 0.316235
C  -1.392613 1.588953 0.281785
C  3.512407 1.380173 0.056681
C  4.326339 -0.847018 -0.135459
C  -3.10531 0.142102 -0.854047
C  -3.053212 0.166441 1.519603
C  4.577913 0.517929 -0.094049
C  -4.697361 -1.173607 0.383102
C  -4.123984 -0.706605 1.560369
C  -4.173599 -0.734313 -0.828168
C  3.016355 -1.275432 -0.005029
C  5.457259 -1.816291 -0.302625
C  -7.00816 -1.471338 0.388988
H  1.13048 2.398695 1.179136
H  1.009651 2.476825 -0.560472
H  -0.08319 0.003258 0.338054
H  5.58124 0.911742 -0.18696
H  2.760527 -2.327296 -0.019217
H  -7.167744 -0.796243 1.233228
H  -7.720563 -2.289957 0.455207
H  -7.18407 -0.925376 -0.540901
totalener: -1995.65901316 hartree
nucrepener: 2623.00886332 hartree
electener: -4618.66787648 hartree
oneelecener: -7967.12657942 hartree
twoeener: 3348.45870294 hartree
kineticenergy: 1989.64781102 hartree
xcener: -153.568791270181 hartree
chargesum: -0.0000000
charge: -0.035191 -0.177805 -0.178670 -0.175964 -0.177561 -0.166373 -0.167435 -0.160681 -0.310903 -0.369157 -0.199005 -0.348891 -0.068023 0.278047 -0.184807 0.357093 -0.049379 -0.078286 0.263242 0.255875 -0.081133 0.118141 0.119230 0.122102 -0.002946 0.543835 -0.098453 0.115665 0.116063 0.165542 0.129259 0.126190 0.100595 0.117947 0.101836
qa: -0.0352 -0.1778 -0.1787 -0.1760 -0.1776 -0.1664 -0.1674 -0.1607 -0.3109 -0.3692 -0.1990 -0.3489 -0.0680 0.2780 -0.1848 0.3571 -0.0494 -0.0783 0.2632 0.2559 -0.0811 0.1181 0.1192 0.1221 -0.0029 0.5438 -0.0985 0.1157 0.1161 0.1655 0.1293 0.1262 0.1006 0.1179 0.1018
va: 1.2896 1.1280 1.1254 1.1250 1.1226 1.1418 1.1373 1.1370 2.0295 2.1503 3.1279 3.0560 3.9972 3.6049 3.6116 4.1579 4.1385 3.7682 3.9664 3.9663 4.0544 3.8070 4.1093 4.0914 4.1089 4.4341 3.8631 0.9997 1.0045 1.0520 1.0253 1.0145 0.9903 0.9939 0.9904
dispcorr: -0.015984326 hartree
energy: -1995.674997486748
dipole: -18.92396 19.30197 0.37801 2.32301 -2.79461 -0.47160 1.38735 -1.36012 0.02723
magnitude: 0.60501 au
magnitude: 1.53782 debye
