program: Gaussian 09
title: 000066102
version: EM64L-G09RevD.01
frameworkgroup: C1[X(C14H14O4)]
method: RPBEPBE
basis: SDD
operation: Freq
keyword: #pfreq=noraman
keyword: PBEPBE/SDD
title: #p freq=noraman PBEPBE/SDD
converged: YES YES NO NO
title: Mulliken charges:
elementType: O O O O C C C C C C C C C C C C C C H H H H H H H H H H H H H H
charge: -0.276640 -0.276668 -0.252809 -0.252780 0.241388 0.241389 -0.327750 -0.327748 -0.344734 -0.344732 0.192988 0.192937 -0.365512 -0.365474 -0.030683 -0.030636 -0.547567 -0.547588 0.274987 0.275001 0.275309 0.275305 0.242280 0.222890 0.242315 0.222901 0.253668 0.253591 0.223855 0.218334 0.223858 0.218327
chargesum: 0.00000
title: Mulliken charges with hydrogens summed into heavy atoms:
elementType: O O O O C C C C C C C C C C C C C C
charge: -0.276640 -0.276668 -0.252809 -0.252780 0.241388 0.241389 -0.052763 -0.052748 -0.069425 -0.069427 0.192988 0.192937 0.099658 0.099742 0.222985 0.222955 -0.105378 -0.105403
polarizability: 2.69759750e+02 1.53809682e-02 1.65807273e+02 4.86930401e+00 -1.00028670e-02 9.67052562e+01
1716.lowfreq: -5.1866 -0.0008 -0.0005 0.0006 6.1425 13.6002 24.5143 32.4463 41.0580
frequency: 24.5098 32.4277 41.0503 42.0289 62.2751 71.9686 86.5527 91.5873 116.3742 123.4929 180.1130 209.4037 255.8676 280.6152 282.1156 338.0604 355.5289 383.3457 391.6397 407.8055 467.1598 473.9496 485.6490 510.2233 628.1622 640.9062 663.6800 664.4722 694.9380 698.5088 747.8125 776.6618 781.8998 873.6440 877.2155 878.7757 891.3351 930.5796 930.8091 962.5344 962.5528 968.9624 969.1642 1004.0116 1007.6428 1012.6818 1016.7154 1017.8384 1049.7357 1060.2114 1115.6172 1158.3630 1158.5420 1183.0933 1233.4802 1251.3329 1252.1978 1253.6699 1286.2651 1286.6946 1302.0892 1347.3661 1347.8996 1386.7410 1407.8647 1428.0326 1428.1947 1448.8617 1449.3255 1492.2095 1568.9632 1611.7116 1620.6943 1621.9260 1660.4978 1660.5064 3021.9654 3022.0265 3090.5405 3090.5770 3109.7014 3109.7232 3130.6165 3130.6654 3154.1357 3169.5174 3172.3570 3188.5864 3201.0339 3201.0604
redmass: 4.0213 4.5057 3.6937 5.5039 6.1689 3.6226 5.6199 2.7714 3.5807 3.3330 4.1609 5.8291 6.0175 4.7231 5.0762 2.9030 2.6766 3.1268 4.2188 2.8657 3.9452 2.7517 2.2941 6.2218 7.0948 2.1743 1.8829 6.0602 4.0444 3.5452 5.4541 5.0181 5.3429 1.2767 4.0832 4.4928 1.6678 1.5920 1.6041 1.4122 1.4092 1.9130 1.9095 1.3593 3.2505 1.3684 1.2318 1.2952 6.0440 3.2054 1.3998 2.0808 2.0474 1.1425 2.9439 1.4366 1.1548 2.6720 1.2399 1.2540 1.2610 1.2474 1.2694 6.2882 3.8681 1.1558 1.1579 1.1435 1.1395 2.5416 8.3461 9.2919 9.9009 6.9436 4.6019 4.6019 1.0604 1.0604 1.0611 1.0611 1.1020 1.1020 1.0971 1.0971 1.0885 1.0887 1.0970 1.0971 1.1143 1.1143
irintensity: 0.0696 0.2467 0.2353 0.1433 0.0008 0.0474 2.5848 0.4235 0.3580 2.8756 1.1690 0.0803 0.1517 23.1808 12.6587 7.8705 0.1010 14.1596 4.6754 0.0010 0.4501 2.4619 0.2698 10.9187 2.0357 2.5162 14.0230 0.3206 0.0404 75.9590 3.6054 0.2678 8.5659 3.3996 96.1611 4.3125 41.6892 0.0424 98.6729 129.3215 25.9833 19.5344 3.3190 0.0123 216.8830 0.0093 0.5754 27.2733 159.7449 361.3759 2.9395 37.2293 7.8470 11.9254 625.9655 70.1925 2.2685 74.0802 16.9277 0.2085 0.3097 23.2951 0.0291 0.0184 28.9282 12.4969 11.5363 57.6037 2.5002 4.5838 53.9117 205.0124 107.7974 49.0202 3.6141 3.0674 59.8549 2.1594 7.6464 9.2161 2.1497 9.2620 6.2581 6.2326 0.1402 0.2637 1.9150 0.8767 21.4635 21.4732
temp: 298.150 k
press: 1.00000 atm
elementType: 8 8 8 8 6 6 6 6 6 6 6 6 6 6 6 6 6 6 1 1 1 1 1 1 1 1 1 1 1 1 1 1
symmnumber: 1
zpe: 647059.1 jmol-1
zpe.correction: 0.246452 hartree
zpe.thermalcorrener: 0.264399 hartree
zpe.thermalcorrenthalpy: 0.265343 hartree
zpe.thermalcorrgfe: 0.197231 hartree
zpe.sumelectzpe: -841.439974 hartree
zpe.sumelectthermal: -841.422027 hartree
zpe.sumelectthermalent: -841.421083 hartree
zpe.sumelectthermalfe: -841.489196 hartree
dipole: -0.0002 -3.4424 0.0005
dipole: 3.4424
quadrupole: -88.2111 -104.5619 -102.9733
quadrupole: 0.0022 1.4962 -0.0014
quadrupole: 10.3710 -5.9798 -4.3912 0.0022 1.4962 -0.0014
hfenergy: -841.6864263 hartree
pointgroup: C01 [X(C14H14O4)]
dipole: -0.0002404 1.3543389 -0.0046838 debye
polarizability: 269.8897856|-0.005385|165.8064463|-1.0910336|-0.2391882|96.5760478 unknown
InChI: InChI=1S/C14H14O4/c1-3-9-17-13(15)11-5-7-12(8-6-11)14(16)18-10-4-2/h3-8H,1-2,9-10H2
charge 0 multiplicity 1
32 atoms
O  3.417444 0.815487 0.636271
O  -3.417673 0.809393 -0.638558
O  3.5420 -1.515425 0.582925
O  -3.541012 -1.521197 -0.569712
C  1.392587 -0.407644 0.244095
C  -1.392191 -0.410058 -0.2382
C  0.69342 0.821238 0.119086
C  -0.693726 0.820032 -0.121441
C  0.693269 -1.637545 0.12613
C  -0.692168 -1.638743 -0.111982
C  2.864522 -0.460417 0.496308
C  -2.864104 -0.465286 -0.490048
C  4.899122 0.865235 0.894668
C  -4.899314 0.856762 -0.897506
C  5.674687 0.81392 -0.396071
C  -5.674756 0.815918 0.393672
C  6.455735 1.828783 -0.841443
C  -6.456439 1.834019 0.830449
H  1.245049 1.76029 0.211325
H  -1.245882 1.758126 -0.219994
H  1.254276 -2.572188 0.224571
H  -1.252636 -2.574354 -0.204132
H  5.153594 0.009341 1.546331
H  5.041833 1.81875 1.426197
H  -5.153605 -0.004548 -1.542069
H  -5.042327 1.805832 -1.436846
H  5.593636 -0.120804 -0.966169
H  -5.593066 -0.113884 0.971677
H  7.028588 1.745433 -1.771471
H  6.55088 2.77036 -0.285668
H  -7.029215 1.758238 1.761171
H  -6.552229 2.770735 0.266634
