program: Orca
programVersion: 5.0.2
elementType: Cl Cl Cl F F F O N N C C C C C C C C C C C C C C H H H H H H H H
charge: 0
multiplicity: 1
keywords: wb97x-d3
keywords: def2-TZVPP
keywords: def2/J RIJCOSX
keywords: DEFGRID2
keywords: scfconv7
keywords: smallprint printgap noloewdin
keywords: NOSOSCF
formula: C14H8Cl3F3N2O
InChI: InChI=1/C14H8Cl3F3N2O/c15-8-2-1-3-9(16)12(8)13(23)22-6-11-10(17)4-7(5-21-11)14(18,19)20/h1-5,22H,6H2
31 atoms
Cl 1.350798 -2.232527 1.280283
Cl -1.612452 -0.245738 -3.312092
Cl -4.181513 -0.347931 1.402729
F  5.455973 1.536805 -0.1501
F  4.999477 2.81646 1.513991
F  5.628156 0.787317 1.856472
O  -3.12121 1.923599 -1.11859
N  -1.363718 1.078313 0.014066
N  1.180007 1.643525 0.589625
C  -0.598153 -0.010534 0.563645
C  0.845379 0.371482 0.73019
C  1.807387 -0.586282 1.047393
C  3.460426 1.115025 1.002622
C  -2.962703 -0.429062 -0.992083
C  3.131859 -0.222016 1.173453
C  -2.48491 0.9662 -0.700611
C  2.444984 2.014652 0.722462
C  4.886838 1.564562 1.062169
C  -2.660834 -1.051587 -2.196803
C  -3.794297 -1.101277 -0.106272
C  -3.157959 -2.304419 -2.513016
C  -4.310704 -2.352571 -0.396092
C  -3.986803 -2.945882 -1.605983
H  -0.664707 -0.882159 -0.088377
H  -0.990994 -0.320795 1.53842
H  -1.034799 2.014765 0.212788
H  3.880422 -0.969703 1.398394
H  2.642568 3.071571 0.596213
H  -2.905285 -2.774158 -3.453194
H  -4.9574 -2.857081 0.308058
H  -4.383295 -3.923175 -1.844379
elementType: Cl F O N C H
totalener: -2403.35417328 hartree
nucrepener: 2331.31802354 hartree
electener: -4734.67219682 hartree
oneelecener: -7945.39767366 hartree
twoeener: 3210.72547684 hartree
cpcmener: -0.03485621 hartree
kineticenergy: 2397.51738019 hartree
xcener: -155.741945672954 hartree
chargesum: -0.0000000
charge: -0.062617 -0.066778 -0.070671 -0.176412 -0.177084 -0.177047 -0.509767 -0.116982 -0.376592 -0.093528 0.332841 -0.044222 -0.065251 -0.010239 -0.069728 0.256095 0.006633 0.551641 0.085683 0.078654 -0.169723 -0.166382 -0.127419 0.122725 0.128132 0.174110 0.139148 0.138880 0.148634 0.150689 0.166578
qa: -0.0626 -0.0668 -0.0707 -0.1764 -0.1771 -0.1770 -0.5098 -0.1170 -0.3766 -0.0935 0.3328 -0.0442 -0.0653 -0.0102 -0.0697 0.2561 0.0066 0.5516 0.0857 0.0787 -0.1697 -0.1664 -0.1274 0.1227 0.1281 0.1741 0.1391 0.1389 0.1486 0.1507 0.1666
va: 1.2597 1.2566 1.2525 1.1139 1.1264 1.1271 1.9833 3.1166 3.0338 4.0072 3.6537 4.1108 3.7198 3.5818 4.0564 4.3332 4.1121 4.4234 3.8955 3.9024 4.0158 4.0173 3.9209 0.9854 0.9900 1.0433 1.0203 1.0108 1.0025 1.0009 0.9843
dispcorr: -0.016899453 hartree
energy: -2403.371072729225
dipole: -16.87585 17.86035 0.98450 -7.15624 4.39685 -2.75939 -3.40531 4.30823 0.90291
magnitude: 3.06573 au
magnitude: 7.79247 debye
