program: Orca
programVersion: 5.0.2
elementType: Cl Cl Cl F F F O N N C C C C C C C C C C C C C C H H H H H H H H
charge: 0
multiplicity: 1
keywords: wb97x-d3
keywords: def2-TZVPP
keywords: def2/J RIJCOSX
keywords: DEFGRID2
keywords: scfconv7
keywords: smallprint printgap noloewdin
keywords: NOSOSCF
formula: C14H8Cl3F3N2O
InChI: InChI=1/C14H8Cl3F3N2O/c15-8-2-1-3-9(16)12(8)13(23)22-6-11-10(17)4-7(5-21-11)14(18,19)20/h1-5,22H,6H2
31 atoms
Cl 0.734678 1.928082 -1.339492
Cl -4.620874 -0.674336 1.376373
Cl -1.125844 -0.829209 -2.705819
F  5.479835 0.006844 -0.024199
F  5.704402 1.562231 1.442501
F  5.383316 -0.466817 2.071565
O  -2.694176 1.479599 -0.626146
N  -1.336525 0.215578 0.685755
N  1.490746 0.686551 2.327684
C  -0.630492 1.28821 1.352415
C  0.857216 1.107303 1.241043
C  1.554727 1.346876 0.057921
C  3.553309 0.673271 1.144859
C  -2.931146 -0.877836 -0.710312
C  2.917594 1.130119 0.000923
C  -2.30584 0.397495 -0.216076
C  2.797293 0.476193 2.289042
C  5.031473 0.440268 1.15727
C  -4.027149 -1.431836 -0.060746
C  -2.482443 -1.497318 -1.869715
C  -4.654753 -2.571464 -0.534227
C  -3.091032 -2.637136 -2.36698
C  -4.178167 -3.167391 -1.690884
H  -0.894726 1.301778 2.409558
H  -0.945336 2.23798 0.924548
H  -1.137058 -0.727522 0.988599
H  3.461715 1.314995 -0.916118
H  3.24913 0.136992 3.212266
H  -5.504591 -2.987103 -0.010945
H  -2.723387 -3.105254 -3.269325
H  -4.661509 -4.056706 -2.071192
elementType: Cl F O N C H
totalener: -2403.35525674 hartree
nucrepener: 2345.31183928 hartree
electener: -4748.66709601 hartree
oneelecener: -7974.20182146 hartree
twoeener: 3225.53472545 hartree
cpcmener: -0.03572649 hartree
kineticenergy: 2397.54298124 hartree
xcener: -155.741833707746 hartree
chargesum: 0.0000000
charge: -0.061767 -0.067805 -0.069352 -0.177331 -0.176652 -0.177108 -0.512502 -0.156208 -0.348501 -0.068242 0.223318 0.008011 -0.056518 -0.022324 -0.099192 0.329494 0.017143 0.554099 0.106002 0.096309 -0.200479 -0.203720 -0.110457 0.111733 0.130475 0.193142 0.140977 0.137035 0.147045 0.146885 0.166489
qa: -0.0618 -0.0678 -0.0694 -0.1773 -0.1767 -0.1771 -0.5125 -0.1562 -0.3485 -0.0682 0.2233 0.0080 -0.0565 -0.0223 -0.0992 0.3295 0.0171 0.5541 0.1060 0.0963 -0.2005 -0.2037 -0.1105 0.1117 0.1305 0.1931 0.1410 0.1370 0.1470 0.1469 0.1665
va: 1.2587 1.2557 1.2589 1.1260 1.1144 1.1270 1.9816 3.1734 3.0753 3.8732 3.7108 4.0052 3.7069 3.5966 4.0724 4.1804 4.0830 4.4198 3.8940 3.9000 4.0504 4.0563 3.9037 1.0260 1.0232 0.9935 1.0207 1.0130 1.0048 1.0042 0.9845
dispcorr: -0.016841573 hartree
energy: -2403.372098308534
dipole: -17.24384 17.52567 0.28182 -7.08986 4.86120 -2.22866 1.54009 -1.15834 0.38176
magnitude: 2.27862 au
magnitude: 5.79178 debye
