program: Orca
programVersion: 5.0.2
elementType: Cl Cl Cl F F F O N N C C C C C C C C C C C C C C H H H H H H H H
charge: 0
multiplicity: 1
keywords: wb97x-d3
keywords: def2-TZVPP
keywords: def2/J RIJCOSX
keywords: DEFGRID2
keywords: scfconv7
keywords: smallprint printgap noloewdin
keywords: NOSOSCF
formula: C14H8Cl3F3N2O
InChI: InChI=1/C14H8Cl3F3N2O/c15-8-2-1-3-9(16)12(8)13(23)22-6-11-10(17)4-7(5-21-11)14(18,19)20/h1-5,22H,6H2
31 atoms
Cl 0.262457 0.43543 2.451975
Cl -0.407715 -2.264598 0.139656
Cl -4.981399 0.194696 -1.303549
F  5.617099 2.212239 -0.063606
F  5.404029 0.886101 1.615218
F  5.347257 0.105359 -0.388287
O  -2.811457 0.433984 1.126062
N  -1.354781 0.791949 -0.582456
N  1.592606 2.180572 -0.830225
C  -0.687175 1.969007 -0.070697
C  0.785068 1.719475 0.117959
C  1.299638 1.029474 1.213615
C  3.482303 1.327639 0.333908
C  -2.739933 -1.148184 -0.635051
C  2.662317 0.829929 1.331482
C  -2.300596 0.105797 0.067507
C  2.898371 1.992299 -0.733663
C  4.964757 1.133368 0.379174
C  -1.95595 -2.29645 -0.63157
C  -3.986579 -1.218587 -1.247434
C  -2.387228 -3.475373 -1.216876
C  -4.442395 -2.383685 -1.839524
C  -3.634868 -3.510009 -1.816965
H  -1.162962 2.270176 0.8599
H  -0.804899 2.78924 -0.777747
H  -1.012169 0.418879 -1.457036
H  3.061107 0.302223 2.187377
H  3.497324 2.391963 -1.542847
H  -1.760335 -4.355803 -1.20123
H  -5.413911 -2.414325 -2.312159
H  -3.982699 -4.425863 -2.274444
elementType: Cl F O N C H
totalener: -2403.35434152 hartree
nucrepener: 2366.44670386 hartree
electener: -4769.80104539 hartree
oneelecener: -8016.55869131 hartree
twoeener: 3246.75764592 hartree
cpcmener: -0.03502966 hartree
kineticenergy: 2397.54403621 hartree
xcener: -155.742506963979 hartree
chargesum: -0.0000000
charge: -0.059644 -0.071940 -0.066536 -0.178398 -0.176749 -0.176860 -0.506307 -0.160327 -0.348684 -0.063399 0.221709 0.001759 -0.056805 0.006222 -0.090097 0.326901 0.007528 0.558774 0.067467 0.081821 -0.183307 -0.184456 -0.120289 0.125930 0.116525 0.191694 0.138390 0.139457 0.147962 0.145599 0.166060
qa: -0.0596 -0.0719 -0.0665 -0.1784 -0.1767 -0.1769 -0.5063 -0.1603 -0.3487 -0.0634 0.2217 0.0018 -0.0568 0.0062 -0.0901 0.3269 0.0075 0.5588 0.0675 0.0818 -0.1833 -0.1845 -0.1203 0.1259 0.1165 0.1917 0.1384 0.1395 0.1480 0.1456 0.1661
va: 1.2600 1.2545 1.2563 1.1239 1.1281 1.1152 1.9861 3.1829 3.0739 3.8785 3.7079 3.9804 3.7083 3.5771 4.0630 4.2016 4.1015 4.4154 3.9078 3.8953 4.0306 4.0362 3.9143 1.0259 1.0238 0.9969 1.0226 1.0121 1.0030 1.0055 0.9849
dispcorr: -0.017236565 hartree
energy: -2403.371578090187
dipole: -15.44899 16.02563 0.57664 -3.59079 2.52269 -1.06810 -8.91760 7.09176 -1.82584
magnitude: 2.19250 au
magnitude: 5.57288 debye
