program: Gaussian 09
title: 000066055
version: EM64L-G09RevD.01
frameworkgroup: C1[X(C5H9NO)]
method: RPBEPBE
basis: SDD
operation: Freq
keyword: #pfreq=noraman
keyword: PBEPBE/SDD
title: #p freq=noraman PBEPBE/SDD
converged: YES YES NO NO
title: Mulliken charges:
elementType: O N C C C C C H H H H H H H H H
charge: -0.254484 -0.366455 -0.060180 -0.436191 -0.519530 0.152323 -0.682294 0.233194 0.236647 0.220985 0.254164 0.245612 0.314440 0.227021 0.218012 0.216737
chargesum: 0.00000
title: Mulliken charges with hydrogens summed into heavy atoms:
elementType: O N C C C C C
charge: -0.254484 -0.052015 0.173014 0.021441 -0.019755 0.152323 -0.020524
polarizability: 7.42995724e+01 -3.83682162e-01 5.91230056e+01 -3.53089895e+00 1.86684863e+00 4.81235649e+01
1716.lowfreq: -23.0977 -0.0008 -0.0006 -0.0005 2.0058 19.3930 103.6045 125.6068 238.0215
frequency: 103.4959 125.4225 238.0190 328.0189 418.1922 454.3860 498.3318 594.1821 640.1115 696.1625 770.0698 823.8497 892.3383 936.9849 963.8936 1009.4742 1045.8544 1084.2244 1128.8047 1173.9052 1197.7794 1245.7290 1269.5422 1281.9463 1325.7548 1348.4097 1382.6436 1391.0160 1453.6226 1467.7491 1474.8438 1477.8719 1665.0241 2978.3521 2996.6649 3016.0490 3023.9437 3074.7645 3081.7733 3084.8023 3097.7332 3565.6781
redmass: 3.0317 2.5965 1.0302 2.3042 2.9225 4.3432 1.5841 2.2726 2.6048 2.9768 1.7781 3.8843 2.1382 1.8774 1.6712 2.1277 1.7476 1.6480 1.6447 1.4449 1.5089 2.6841 1.3819 1.4586 1.4006 1.4870 1.5300 1.4861 1.0800 1.0653 1.0495 1.0895 8.5960 1.0354 1.0840 1.0629 1.0669 1.1004 1.1002 1.1004 1.1013 1.0783
irintensity: 0.1254 1.5699 0.0927 0.6869 0.8845 7.5033 35.9819 54.2997 74.9423 3.1671 5.5553 3.1371 1.7634 2.7197 6.8843 3.1053 10.8446 2.0666 15.7429 7.1467 4.1954 110.6009 18.5619 10.9988 2.6298 15.5479 37.1894 16.9567 5.1054 14.9446 7.7092 5.2942 420.2580 22.7777 27.2065 24.9819 29.0119 18.3590 26.7894 45.2277 30.5843 20.8473
temp: 298.150 k
press: 1.00000 atm
elementType: 8 7 6 6 6 6 6 1 1 1 1 1 1 1 1 1
symmnumber: 1
zpe: 357847.4 jmol-1
zpe.correction: 0.136297 hartree
zpe.thermalcorrener: 0.143182 hartree
zpe.thermalcorrenthalpy: 0.144126 hartree
zpe.thermalcorrgfe: 0.105443 hartree
zpe.sumelectzpe: -325.369030 hartree
zpe.sumelectthermal: -325.362146 hartree
zpe.sumelectthermalent: -325.361201 hartree
zpe.sumelectthermalfe: -325.399884 hartree
dipole: 4.5661 0.8417 -0.6633
dipole: 4.6901
quadrupole: -52.7948 -38.8044 -41.6987
quadrupole: -3.9773 0.6197 1.5250
quadrupole: -8.3622 5.6283 2.7339 -3.9773 0.6197 1.5250
hfenergy: -325.5053273 hartree
pointgroup: C01 [X(C5H9N1O1)]
dipole: 1.8095322 0.2708032 -0.2391476 debye
dipolederiv: -1.2840558 -0.0997652 0.1269119 -0.3014874 -0.5658689 0.006541 0.1260215 -0.0335972 -0.3943585 -1.0867313 0.1185608 0.0540797 0.3725285 -0.447958 -0.0672959 0.1957182 -0.0519195 -0.5857406 0.6391679 0.0136181 0.0459115 0.216704 0.1875134 -0.0548316 0.0653436 -0.0453308 0.390504 0.0229018 0.076462 0.0452413 0.029489 -0.00885 -0.0122482 0.0130028 -0.0284394 0.1148545 -0.0458172 -0.1417831 0.0152784 -0.1542111 -0.2977349 -0.098983 -0.0084223 -0.1163795 0.1002747 1.7606983 0.0234765 -0.3049084 -0.1263138 0.8658246 0.2130519 -0.3935746 0.2293054 0.2826319 -0.0726747 0.028531 -0.0782139 0.0144009 0.0346022 0.0657928 -0.1045096 0.0421971 -0.0597645 -0.0766117 0.0213985 0.0748313 0.0071942 0.0450264 -0.0322115 0.1007087 -0.0307124 -0.1463996 0.0488957 0.0296285 -0.0164965 0.019259 0.0156101 0.0776159 0.0146877 0.1167747 -0.1182623 -0.0657738 -0.1092841 -0.0574602 -0.0886671 0.0223206 -0.0462434 -0.0875285 -0.0721445 0.0297016 -0.0124483 0.0959627 -0.0256676 0.0830279 0.0013236 0.0322432 -0.0309253 0.06395 0.0858117 0.0635285 -0.0303943 -0.0091866 -0.0089144 0.0842157 0.0026217 0.0244073 -0.0261816 -0.1095644 0.1288845 -0.004798 0.0459282 -0.0339584 0.11622 -0.0455211 0.0502357 -0.0227753 0.3486755 0.0404833 0.0244446 0.1064891 0.0255659 0.0811298 -0.054397 0.0523635 -0.0245689 -0.0956563 0.0868243 0.033333 -0.0189397 0.0745893 -0.1693219 0.0029326 -0.0119784 -0.027585 0.0752006 -0.1472716 -0.0793909 -0.0037986 -0.1292063 0.0359473 0.0109325 -0.0055503 0.027407 0.0820918 unknown
polarizability: 74.3468376|-0.9266565|59.1965158|-3.1106259|1.8729653|48.0027895 unknown
InChI: InChI=1S/C5H9NO/c1-4-2-3-5(7)6-4/h4,6H,2-3H2,1H3
charge 0 multiplicity 1
16 atoms
O  -2.351794 -0.562766 0.192348
N  -0.106157 -0.911282 -0.449235
C  1.205724 -0.228274 -0.462197
C  0.785677 1.274486 -0.324176
C  -0.611127 1.245543 0.346994
C  -1.168525 -0.155809 0.0331
C  2.132474 -0.71498 0.674756
H  1.70818 -0.402032 -1.433133
H  0.711344 1.730007 -1.327278
H  1.532525 1.845065 0.252711
H  -1.30114 2.01697 -0.030343
H  -0.561452 1.359901 1.445764
H  -0.221947 -1.902711 -0.664348
H  1.681847 -0.511031 1.66304
H  2.317937 -1.802488 0.601678
H  3.108836 -0.1989 0.622018
