program: Orca
programVersion: 5.0.2
elementType: Cl Cl Cl F F F O N N C C C C C C C C C C C C C C H H H H H H H H
charge: 0
multiplicity: 1
keywords: wb97x-d3
keywords: def2-TZVPP
keywords: def2/J RIJCOSX
keywords: DEFGRID2
keywords: scfconv7
keywords: smallprint printgap noloewdin
keywords: NOSOSCF
formula: C14H8Cl3F3N2O
InChI: InChI=1/C14H8Cl3F3N2O/c15-8-2-1-3-9(16)12(8)13(23)22-6-11-10(17)4-7(5-21-11)14(18,19)20/h1-5,22H,6H2
31 atoms
Cl 0.131373 2.712931 2.058395
Cl -4.485253 0.307322 -2.314188
Cl -0.393528 -1.802208 0.459858
F  5.528606 0.573121 1.057327
F  4.423574 -0.175805 2.743316
F  4.600207 -1.362767 0.956359
O  -2.462997 1.054791 0.405037
N  -1.061749 0.972376 -1.378063
N  1.837179 0.94135 -1.040796
C  -0.245589 2.114063 -1.025288
C  0.981935 1.632806 -0.293352
C  1.211248 1.805205 1.067501
C  3.193656 0.510173 0.858613
C  -2.498669 -0.886852 -0.94886
C  2.329659 1.236124 1.656468
C  -2.012011 0.483259 -0.569166
C  2.90636 0.39639 -0.496632
C  4.43561 -0.11574 1.410597
C  -3.651352 -1.076443 -1.698304
C  -1.836768 -2.012494 -0.47345
C  -4.137486 -2.343903 -1.972591
C  -2.301929 -3.291061 -0.72782
C  -3.457476 -3.44527 -1.477383
H  -0.834886 2.820071 -0.447803
H  0.062306 2.616152 -1.941761
H  -0.711294 0.376224 -2.113694
H  2.50489 1.362422 2.716479
H  3.559729 -0.151204 -1.166623
H  -5.035665 -2.472375 -2.560763
H  -1.774453 -4.154361 -0.346262
H  -3.832458 -4.439222 -1.680726
elementType: Cl F O N C H
totalener: -2403.36160845 hartree
nucrepener: 2391.93355775 hartree
electener: -4795.29516620 hartree
oneelecener: -8067.83932328 hartree
twoeener: 3272.54415708 hartree
cpcmener: -0.02810081 hartree
kineticenergy: 2397.54074320 hartree
xcener: -155.739098063865 hartree
chargesum: -0.0000000
charge: -0.057213 -0.064094 -0.073224 -0.176437 -0.175274 -0.177428 -0.463579 -0.157853 -0.340751 -0.043441 0.140198 0.083464 -0.040793 0.002397 -0.108622 0.288802 -0.025601 0.559877 0.097740 0.085038 -0.188277 -0.195597 -0.118438 0.105355 0.127798 0.187129 0.135643 0.138098 0.144529 0.147283 0.163275
qa: -0.0572 -0.0641 -0.0732 -0.1764 -0.1753 -0.1774 -0.4636 -0.1579 -0.3408 -0.0434 0.1402 0.0835 -0.0408 0.0024 -0.1086 0.2888 -0.0256 0.5599 0.0977 0.0850 -0.1883 -0.1956 -0.1184 0.1054 0.1278 0.1871 0.1356 0.1381 0.1445 0.1473 0.1633
va: 1.2580 1.2590 1.2535 1.1170 1.1305 1.1243 2.0440 3.1529 3.0395 3.9070 3.7434 3.9508 3.6800 3.5672 4.0908 4.2546 4.1402 4.4147 3.8989 3.9082 4.0407 4.0548 3.9132 1.0351 1.0146 1.0056 1.0229 1.0130 1.0054 1.0025 0.9857
dispcorr: -0.017941197 hartree
energy: -2403.379549644710
dipole: -12.85403 13.31491 0.46088 -4.51504 3.34409 -1.17095 -11.77555 10.26223 -1.51332
magnitude: 1.96816 au
magnitude: 5.00266 debye
