program: Orca
programVersion: 5.0.2
elementType: Cl Cl Cl F F F O N N C C C C C C C C C C C C C C H H H H H H H H
charge: 0
multiplicity: 1
keywords: wb97x-d3
keywords: def2-TZVPP
keywords: def2/J RIJCOSX
keywords: DEFGRID2
keywords: scfconv7
keywords: smallprint printgap noloewdin
keywords: NOSOSCF
formula: C14H8Cl3F3N2O
InChI: InChI=1/C14H8Cl3F3N2O/c15-8-2-1-3-9(16)12(8)13(23)22-6-11-10(17)4-7(5-21-11)14(18,19)20/h1-5,22H,6H2
31 atoms
Cl 0.271205 0.464059 2.473341
Cl -0.412281 -2.30214 0.131559
Cl -4.973789 0.200065 -1.28357
F  5.626854 2.196819 -0.100648
F  5.413001 0.925017 1.620727
F  5.336061 0.082649 -0.35745
O  -2.79239 0.410644 1.13839
N  -1.333363 0.766382 -0.567907
N  1.592644 2.184357 -0.82344
C  -0.687161 1.960382 -0.072275
C  0.787764 1.729227 0.128133
C  1.305796 1.050422 1.229924
C  3.486748 1.342873 0.338597
C  -2.736714 -1.160474 -0.634008
C  2.669262 0.854004 1.3434
C  -2.289022 0.086424 0.07959
C  2.898627 2.000596 -0.732081
C  4.968327 1.138194 0.379816
C  -1.960725 -2.314341 -0.640501
C  -3.984588 -1.217747 -1.24584
C  -2.400629 -3.485617 -1.235098
C  -4.449001 -2.375459 -1.846172
C  -3.649058 -3.507148 -1.834022
H  -1.17423 2.269446 0.850456
H  -0.807241 2.766581 -0.796323
H  -1.018502 0.415994 -1.461657
H  3.071651 0.33339 2.202228
H  3.494151 2.397187 -1.546194
H  -1.780087 -4.370997 -1.225912
H  -5.422346 -2.396311 -2.3164
H  -4.003836 -4.41738 -2.298249
elementType: Cl F O N C H
totalener: -2403.36176933 hartree
nucrepener: 2363.67632688 hartree
electener: -4767.03809621 hartree
oneelecener: -8011.01169531 hartree
twoeener: 3243.97359911 hartree
cpcmener: -0.02869094 hartree
kineticenergy: 2397.53759760 hartree
xcener: -155.739964224403 hartree
chargesum: 0.0000000
charge: -0.054808 -0.071262 -0.064585 -0.177207 -0.176228 -0.175661 -0.468111 -0.164968 -0.343102 -0.066305 0.214853 0.001689 -0.058765 -0.001693 -0.093753 0.316762 0.006093 0.557277 0.066686 0.084527 -0.183967 -0.184972 -0.118400 0.127260 0.116270 0.185812 0.137480 0.138086 0.145268 0.143260 0.162465
qa: -0.0548 -0.0713 -0.0646 -0.1772 -0.1762 -0.1757 -0.4681 -0.1650 -0.3431 -0.0663 0.2149 0.0017 -0.0588 -0.0017 -0.0938 0.3168 0.0061 0.5573 0.0667 0.0845 -0.1840 -0.1850 -0.1184 0.1273 0.1163 0.1858 0.1375 0.1381 0.1453 0.1433 0.1625
va: 1.2650 1.2541 1.2574 1.1255 1.1285 1.1163 2.0347 3.1646 3.0770 3.8768 3.7129 3.9895 3.7092 3.5858 4.0627 4.2153 4.1017 4.4164 3.9125 3.8986 4.0352 4.0412 3.9165 1.0254 1.0236 1.0002 1.0233 1.0121 1.0043 1.0065 0.9863
dispcorr: -0.017191506 hartree
energy: -2403.378960833269
dipole: -15.53160 15.96432 0.43272 -3.56629 2.59666 -0.96963 -9.03375 7.31469 -1.71906
magnitude: 2.02054 au
magnitude: 5.13581 debye
