program: Orca
programVersion: 5.0.2
elementType: Cl Cl Cl F F F O N N C C C C C C C C C C C C C C H H H H H H H H
charge: 0
multiplicity: 1
keywords: wb97x-d3
keywords: def2-TZVPP
keywords: def2/J RIJCOSX
keywords: DEFGRID2
keywords: scfconv7
keywords: smallprint printgap noloewdin
keywords: NOSOSCF
formula: C14H8Cl3F3N2O
InChI: InChI=1/C14H8Cl3F3N2O/c15-8-2-1-3-9(16)12(8)13(23)22-6-11-10(17)4-7(5-21-11)14(18,19)20/h1-5,22H,6H2
31 atoms
Cl 1.909949 -2.096086 -0.672519
Cl -2.575535 0.770337 -3.207213
Cl -3.399401 -1.294441 1.680195
F  5.656816 1.794966 0.799095
F  4.717352 2.450566 2.619658
F  5.418611 0.419718 2.429333
O  -3.367709 1.814237 0.056625
N  -1.271711 0.968969 0.050232
N  1.19193 1.459785 0.856606
C  -0.331848 -0.073278 -0.243461
C  1.0374 0.292658 0.261004
C  2.119509 -0.578396 0.110878
C  3.491703 1.007067 1.235963
C  -3.08784 -0.360623 -0.821968
C  3.357315 -0.220819 0.600373
C  -2.596235 0.920991 -0.194967
C  2.374527 1.818582 1.332611
C  4.8261 1.424285 1.776791
C  -3.179671 -0.4955 -2.200628
C  -3.545518 -1.409902 -0.03599
C  -3.721379 -1.627655 -2.786564
C  -4.090769 -2.553537 -0.595428
C  -4.180778 -2.650695 -1.974012
H  -0.264134 -0.26959 -1.320087
H  -0.623476 -1.021761 0.221202
H  -0.904002 1.804219 0.486009
H  4.195897 -0.895974 0.492689
H  2.417645 2.788005 1.81232
H  -3.783784 -1.704259 -3.862701
H  -4.441343 -3.353995 0.040399
H  -4.608781 -3.537625 -2.420827
totalener: -2403.33852002 hartree
nucrepener: 2324.02788382 hartree
electener: -4727.36640384 hartree
oneelecener: -7930.76233330 hartree
twoeener: 3203.39592946 hartree
kineticenergy: 2397.57061362 hartree
xcener: -155.747420967020 hartree
chargesum: -0.0000000
charge: -0.041463 -0.054705 -0.053604 -0.161984 -0.166060 -0.167715 -0.342063 -0.152193 -0.339166 -0.079108 0.273101 -0.040524 -0.076263 0.038875 -0.090301 0.219989 -0.001518 0.543163 0.045621 0.041609 -0.150850 -0.147604 -0.112499 0.107701 0.106443 0.162992 0.127473 0.128230 0.125487 0.125851 0.131084
qa: -0.0415 -0.0547 -0.0536 -0.1620 -0.1661 -0.1677 -0.3421 -0.1522 -0.3392 -0.0791 0.2731 -0.0405 -0.0763 0.0389 -0.0903 0.2200 -0.0015 0.5432 0.0456 0.0416 -0.1508 -0.1476 -0.1125 0.1077 0.1064 0.1630 0.1275 0.1282 0.1255 0.1259 0.1311
va: 1.2855 1.2653 1.2665 1.1366 1.1432 1.1365 2.1736 3.0700 3.0652 4.0402 3.6528 4.1285 3.7655 3.5770 4.0730 4.3516 4.1016 4.4376 3.9545 3.9575 4.0510 4.0473 3.9671 0.9898 0.9884 1.0587 1.0266 1.0139 1.0110 1.0109 0.9977
dispcorr: -0.016845333 hartree
energy: -2403.355365355477
dipole: -16.74797 17.62048 0.87250 -6.57069 4.93920 -1.63149 -6.72941 6.17488 -0.55453
magnitude: 1.93146 au
magnitude: 4.90938 debye
