program: Orca
programVersion: 5.0.2
elementType: Cl Cl Cl F F F O N N C C C C C C C C C C C C C C H H H H H H H H
charge: 0
multiplicity: 1
keywords: wb97x-d3
keywords: def2-TZVPP
keywords: def2/J RIJCOSX
keywords: DEFGRID2
keywords: scfconv7
keywords: smallprint printgap noloewdin
keywords: NOSOSCF
formula: C14H8Cl3F3N2O
InChI: InChI=1/C14H8Cl3F3N2O/c15-8-2-1-3-9(16)12(8)13(23)22-6-11-10(17)4-7(5-21-11)14(18,19)20/h1-5,22H,6H2
31 atoms
Cl 0.734407 1.948542 -1.339575
Cl -4.615283 -0.68331 1.383978
Cl -1.103401 -0.841662 -2.682227
F  5.476164 0.022409 -0.034656
F  5.688926 1.554982 1.459395
F  5.373619 -0.486672 2.056649
O  -2.688032 1.492138 -0.6253
N  -1.332612 0.222566 0.682612
N  1.48039 0.672522 2.314721
C  -0.635586 1.295661 1.349672
C  0.853793 1.115518 1.23513
C  1.551267 1.359925 0.050289
C  3.547837 0.663042 1.140229
C  -2.933808 -0.867884 -0.710558
C  2.913578 1.133737 0.000565
C  -2.3170 0.418028 -0.223774
C  2.783627 0.453142 2.278093
C  5.028485 0.433983 1.154598
C  -4.025709 -1.426374 -0.058195
C  -2.471684 -1.494098 -1.861118
C  -4.645718 -2.571145 -0.531046
C  -3.075974 -2.63859 -2.354903
C  -4.165378 -3.168787 -1.684227
H  -0.889694 1.315913 2.410897
H  -0.963332 2.234065 0.904272
H  -1.149768 -0.716738 0.994339
H  3.458299 1.320447 -0.915261
H  3.229799 0.090355 3.195911
H  -5.493657 -2.984611 -0.003942
H  -2.697984 -3.106027 -3.252876
H  -4.6452 -4.06061 -2.06355
totalener: -2403.33800989 hartree
nucrepener: 2347.00633642 hartree
electener: -4750.34434631 hartree
oneelecener: -7977.37122880 hartree
twoeener: 3227.02688249 hartree
kineticenergy: 2397.59417233 hartree
xcener: -155.745580636342 hartree
chargesum: -0.0000000
charge: -0.027832 -0.050380 -0.053550 -0.168887 -0.162001 -0.168287 -0.349411 -0.186782 -0.287520 -0.083861 0.164583 0.007775 -0.062408 -0.068197 -0.117039 0.311503 -0.005199 0.543496 0.103484 0.099169 -0.190079 -0.194787 -0.085743 0.114539 0.135681 0.148815 0.129406 0.122741 0.123857 0.124464 0.132449
qa: -0.0278 -0.0504 -0.0535 -0.1689 -0.1620 -0.1683 -0.3494 -0.1868 -0.2875 -0.0839 0.1646 0.0078 -0.0624 -0.0682 -0.1170 0.3115 -0.0052 0.5435 0.1035 0.0992 -0.1901 -0.1948 -0.0857 0.1145 0.1357 0.1488 0.1294 0.1227 0.1239 0.1245 0.1324
va: 1.2939 1.2703 1.2716 1.1362 1.1336 1.1383 2.1630 3.1109 3.0912 3.8637 3.7264 4.0465 3.7249 3.6402 4.0657 4.1778 4.1005 4.4313 3.9473 3.9472 4.0901 4.0998 3.9349 1.0212 1.0225 1.0232 1.0273 1.0153 1.0136 1.0128 0.9972
dispcorr: -0.016859953 hartree
energy: -2403.354869839796
dipole: -17.25115 17.17798 -0.07317 -7.09904 5.75476 -1.34429 1.50720 -1.39537 0.11183
magnitude: 1.35091 au
magnitude: 3.43375 debye
