program: Orca
programVersion: 5.0.2
elementType: S S O N N N N C C C C C C C C C C C C C C H H H H H H H H H H H H H H H H
charge: 0
multiplicity: 1
keywords: wb97x-d3
keywords: def2-TZVPP
keywords: def2/J RIJCOSX
keywords: DEFGRID2
keywords: scfconv7
keywords: smallprint printgap noloewdin
keywords: NOSOSCF
formula: C14H16N4OS2
InChI: InChI=1/C14H16N4OS2/c1-3-9-12(21-14(18-9)16-4-2)13(19)17-10(8-15)11-6-5-7-20-11/h5-7,10,16-17H,3-4H2,1-2H3
37 atoms
S  -1.984922 0.756037 0.763745
S  3.421577 2.075344 0.029222
O  0.885183 -1.513718 -0.745194
N  0.930048 -0.075047 0.968659
N  -3.313096 -0.598114 -0.973851
N  -4.583819 0.974162 0.196199
N  3.003383 -2.742551 1.571714
C  -2.041839 -1.054816 -1.03944
C  -1.146949 -0.461133 -0.175166
C  -1.756668 -2.166559 -1.998564
C  2.349831 -0.240681 1.160547
C  -3.44328 0.349917 -0.076216
C  0.272489 -0.728822 -0.024698
C  3.200953 0.368036 0.07867
C  -1.746708 -3.530549 -1.310884
C  -4.693506 2.085703 1.119994
C  3.862316 -0.241607 -0.943933
C  -6.128316 2.554624 1.222061
C  4.553968 0.678712 -1.775938
C  2.704609 -1.652273 1.357612
C  4.397611 1.967728 -1.371909
H  -2.536106 -2.154554 -2.760835
H  -0.810084 -2.001114 -2.508529
H  2.580338 0.24426 2.113519
H  0.458438 0.498678 1.649521
H  -0.970321 -3.591979 -0.549152
H  -1.562182 -4.319792 -2.039657
H  -2.703765 -3.738349 -0.831859
H  -5.378643 0.739959 -0.381108
H  -4.33584 1.77621 2.106375
H  -4.056413 2.912362 0.789532
H  3.864574 -1.310951 -1.102489
H  -6.779832 1.767846 1.601661
H  -6.188955 3.399462 1.905841
H  -6.508423 2.88115 0.253608
H  5.136872 0.390846 -2.63864
H  4.807256 2.860479 -1.819737
elementType: S O N C H
totalener: -1633.85146981 hartree
nucrepener: 1888.48368921 hartree
electener: -3522.33515903 hartree
oneelecener: -5991.88009460 hartree
twoeener: 2469.54493557 hartree
cpcmener: -0.05020113 hartree
kineticenergy: 1628.86007253 hartree
xcener: -119.651866077966 hartree
chargesum: -0.0000000
charge: -0.037213 0.054150 -0.559780 -0.191290 -0.383957 -0.172044 -0.109061 0.099831 -0.108550 -0.099802 0.394102 0.231706 0.435821 -0.101031 -0.271406 -0.011763 -0.172862 -0.274207 -0.217063 -0.238853 -0.165077 0.079908 0.078950 0.147896 0.174218 0.083729 0.096232 0.090742 0.175156 0.099050 0.103950 0.153239 0.095326 0.090877 0.091526 0.168535 0.169015
qa: -0.0372 0.0542 -0.5598 -0.1913 -0.3840 -0.1720 -0.1091 0.0998 -0.1086 -0.0998 0.3941 0.2317 0.4358 -0.1010 -0.2714 -0.0118 -0.1729 -0.2742 -0.2171 -0.2389 -0.1651 0.0799 0.0790 0.1479 0.1742 0.0837 0.0962 0.0907 0.1752 0.0990 0.1040 0.1532 0.0953 0.0909 0.0915 0.1685 0.1690
va: 2.6393 2.7684 1.9437 3.2022 3.0223 3.2030 3.1058 3.9646 3.6811 3.8514 3.8344 4.2357 4.0648 3.7274 3.9233 3.8464 3.9137 3.9666 4.0077 4.0800 3.9955 1.0245 1.0290 1.0020 1.0158 1.0110 1.0037 1.0029 1.0161 0.9892 0.9915 1.0145 1.0011 1.0049 0.9998 0.9931 0.9924
dispcorr: -0.016511634 hartree
energy: -1633.867981448439
dipole: -22.74694 20.31053 -2.43641 -0.15155 4.04125 3.88970 -3.44108 4.56131 1.12023
magnitude: 4.72449 au
magnitude: 12.00869 debye
