program: Gaussian 09
title: 000066049
version: EM64L-G09RevD.01
frameworkgroup: C1[X(C6H5BrS)]
method: RPBEPBE
basis: SDD
operation: Freq
keyword: #p
keyword: freq=noraman
keyword: PBEPBE/SDD
title: #p freq=noraman PBEPBE/SDD
converged: NO YES NO YES
title: Mulliken charges:
elementType: Br S C C C C C C H H H H H
charge: 0.010049 0.004102 -0.181089 -0.208132 -0.182528 -0.172517 -0.172876 -0.203668 0.249165 0.232981 0.254114 0.253178 0.117220
chargesum: 0.00000
title: Mulliken charges with hydrogens summed into heavy atoms:
elementType: Br S C C C C C C
charge: 0.010049 0.121322 -0.181089 0.041033 0.050453 0.081598 0.080302 -0.203668
polarizability: 1.62481217e+02 2.07701002e+00 8.51790001e+01 1.69779644e-03 1.76240975e-02 3.30536719e+01
1716.lowfreq: -9.7312 -3.5990 -0.0008 0.0005 0.0014 21.8061 83.1456 160.4130 173.8246
frequency: 83.1433 159.9990 173.8228 247.2432 269.8758 309.3821 403.2262 459.3976 479.3406 619.1560 691.9339 700.8390 807.4376 820.9929 882.1437 938.8767 958.1660 984.6509 1058.9627 1083.2444 1112.9077 1191.3922 1291.6377 1356.1454 1386.1399 1455.2487 1573.0418 1578.2435 2447.3937 3132.6406 3145.7288 3169.1968 3173.1043
redmass: 11.0391 1.0915 8.6252 22.5724 5.5892 4.2183 2.8625 9.6430 2.9489 7.1328 3.8728 7.3508 1.3890 1.3163 1.1121 1.3282 1.3644 5.9597 4.0348 2.4201 1.3677 1.1129 1.2386 4.8853 3.7138 2.1143 7.5881 6.2775 1.0383 1.0900 1.0894 1.0953 1.0969
irintensity: 0.3638 30.3955 0.9265 0.9771 0.4144 2.4972 0.1908 19.2488 37.7908 0.2208 0.0281 1.1048 50.7112 22.6770 10.8455 0.1831 0.0021 86.0847 8.8777 65.6293 7.6323 4.7385 0.4516 6.1233 5.5176 105.8643 0.1115 1.1561 14.8976 7.0705 3.4194 6.9513 0.9396
temp: 298.150 k
press: 1.00000 atm
elementType: 35 16 6 6 6 6 6 6 1 1 1 1 1
symmnumber: 1
zpe: 228155.7 jmol-1
zpe.correction: 0.086900 hartree
zpe.thermalcorrener: 0.094741 hartree
zpe.thermalcorrenthalpy: 0.095685 hartree
zpe.thermalcorrgfe: 0.052923 hartree
zpe.sumelectzpe: -642.574440 hartree
zpe.sumelectthermal: -642.566599 hartree
zpe.sumelectthermalent: -642.565654 hartree
zpe.sumelectthermalfe: -642.608416 hartree
dipole: 1.3108 1.0765 0.0033
dipole: 1.6961
quadrupole: -64.8327 -54.5018 -68.5685
quadrupole: 5.2470 0.0143 0.0055
quadrupole: -2.1983 8.1325 -5.9342 5.2470 0.0143 0.0055
hfenergy: -642.6613396 hartree
pointgroup: C01 [X(C6H5Br1S1)]
dipole: 0.5123725 0.427529 0.0020824 debye
dipolederiv: -0.7532914 -0.0103123 -0.0008098 -0.0049011 -0.0693536 -0.0000201 -0.0007877 -0.0000423 -0.0373709 -0.6376871 -0.0762709 -0.000576 -0.1126677 0.1876875 0.0011221 -0.0000438 0.0011743 -0.1553866 1.150473 0.0211829 0.0010295 0.1423442 -0.0974103 -0.0001432 0.0013283 -0.0002995 -0.0757499 -0.2997616 -0.0580786 -0.0000611 -0.0958236 0.0527559 -0.0001231 -0.0004803 -0.0000469 -0.118048 -0.3402562 0.0420612 -0.0002101 0.0807661 0.0350533 0.0000912 0.0001817 0.0002443 -0.140287 -0.2336012 0.0631358 -0.0002044 -0.0315964 0.0617377 0.000076 -0.0002104 0.0001654 -0.0913685 -0.263929 -0.0560533 -0.000243 0.0266327 0.0612936 0.0001689 -0.000172 0.0000226 -0.0798048 1.2403419 0.0081882 0.0015759 0.0289483 -0.0499841 0.0000458 0.0015812 0.0000829 -0.1415305 0.0194549 0.0853513 -0.0001319 0.062769 -0.0067095 0.0000971 -0.0001584 0.0000574 0.1659225 -0.0176762 -0.0977302 -0.0002439 -0.068675 -0.0227431 -0.000129 -0.0002069 -0.0002238 0.162049 0.0518555 -0.0712304 -0.0001715 -0.0662 -0.0089155 -0.0001505 -0.0001579 -0.0001749 0.1652564 0.0447622 0.0685753 -0.0000888 0.065934 -0.0076412 -0.0000289 -0.0001601 -0.0000621 0.1653484 0.039315 0.081181 0.000135 -0.0275305 -0.1357707 -0.0010062 -0.0007137 -0.0008975 0.1809699 unknown
polarizability: 162.4439646|2.6795983|85.2160644|0.1404922|0.0496484|33.0538604 unknown
InChI: InChI=1S/C6H5BrS/c7-5-1-3-6(8)4-2-5/h1-4,8H
charge 0 multiplicity 1
13 atoms
Br -3.358359 -0.018813 -0.003006
S  3.254762 -0.052307 0.003673
C  1.422164 0.020736 0.00233
C  0.720153 -1.209774 0.001027
C  0.70061 1.238067 0.002112
C  -0.691913 -1.225229 -0.000618
C  -0.712499 1.230336 0.000657
C  -1.3949 -0.002747 -0.00079
H  1.26488 -2.159777 0.001481
H  1.224273 2.200895 0.003041
H  -1.228039 -2.178496 -0.001685
H  -1.264502 2.17457 0.000623
H  3.47347 1.314639 0.008155
