program: Gaussian 09
title: 000066067
version: EM64L-G09RevD.01
frameworkgroup: C1[X(C10H14NO5P)]
method: RPBEPBE
basis: SDD
operation: Freq
keyword: #p
keyword: freq=noraman
keyword: PBEPBE/SDD
title: #p freq=noraman PBEPBE/SDD
converged: YES YES NO NO
title: Mulliken charges:
elementType: P O O O O O N C C C C C C C C C C H H H H H H H H H H H H H H
charge: 1.264367 -0.547385 -0.495962 -0.602438 -0.212770 -0.217532 0.021701 -0.675415 -0.631550 0.381323 -0.229261 -0.297065 -0.355267 -0.651266 0.380828 -0.343842 -0.334080 0.290855 0.261017 0.235683 0.234068 0.253488 0.203945 0.233564 0.307567 0.262201 0.210188 0.241133 0.234445 0.288571 0.288891
chargesum: 0.00000
title: Mulliken charges with hydrogens summed into heavy atoms:
elementType: P O O O O O N C C C C C C C C C C
charge: 1.264367 -0.547385 -0.495962 -0.602438 -0.212770 -0.217532 0.021701 -0.123543 0.091689 0.381323 0.208248 0.010502 -0.093066 0.034499 0.380828 -0.055271 -0.045189
polarizability: 2.44749924e+02 1.10644285e+01 1.19277734e+02 -7.81196052e+00 1.41587301e+01 1.42572546e+02
1716.lowfreq: -16.0556 -7.6148 -5.2498 0.0011 0.0016 0.0018 8.1355 20.7522 22.5490
frequency: -5.4328 20.4057 22.0880 40.4659 60.0018 70.9457 80.4223 96.9769 132.6624 139.9017 184.2029 191.1449 230.4799 234.2301 254.2158 264.6860 275.5693 309.9320 339.6147 379.2942 393.7798 415.2634 465.1787 495.0259 506.7738 555.7870 601.7108 624.5451 665.4064 669.2109 694.1085 732.7705 772.5654 776.7319 810.2066 834.6542 836.9785 868.9167 880.2165 982.4851 986.9099 994.5138 998.4722 1013.9257 1023.3596 1054.3115 1079.6586 1094.6200 1105.3549 1108.9507 1128.8008 1170.3465 1210.3365 1224.5550 1241.7283 1252.4100 1281.1042 1294.3273 1351.9042 1356.4552 1395.6608 1397.3180 1406.0944 1428.2127 1429.1121 1456.9093 1473.4952 1474.1484 1476.4369 1484.6507 1488.1946 1589.7982 1603.1228 2973.1246 2997.7897 2997.9409 3032.8824 3044.1339 3087.8196 3095.1390 3097.5065 3110.7431 3114.2452 3157.4449 3167.7248 3184.5552 3189.3468
redmass: 2.5971 3.4125 4.4467 2.4495 3.6769 7.1142 4.8314 4.5115 4.7362 5.1302 1.7635 7.2609 1.8297 3.2828 1.7134 2.6456 6.0299 6.3961 5.9142 7.0957 4.7586 3.0401 7.5613 3.2217 7.4298 7.7810 5.4612 7.3458 4.8685 9.5552 4.9299 4.9326 1.2555 9.4050 1.0913 6.1675 1.3090 1.6264 3.6678 1.3297 1.7959 1.3400 3.0241 2.6338 2.0910 2.0586 2.7015 3.1916 2.2108 1.2867 1.4112 1.4817 3.3312 6.1205 1.2080 1.1567 1.3350 1.2877 1.2584 7.8844 1.2349 9.9673 1.1809 1.0784 4.0261 1.0395 1.9356 1.0715 1.1262 1.0538 1.0726 7.8546 6.5161 1.0579 1.0360 1.0365 1.0591 1.1051 1.1019 1.0982 1.1003 1.1028 1.1020 1.0925 1.0892 1.0950 1.0971
irintensity: 0.0676 0.6792 0.8288 1.9679 2.7260 0.0068 0.4444 3.2537 2.3518 1.1872 1.0977 4.2050 4.3179 24.2368 5.9308 9.7756 1.8577 3.2505 15.3298 3.6398 11.2947 0.2045 64.5718 14.5041 26.2763 21.4240 19.4709 32.4917 26.5847 195.4949 74.2624 7.5890 20.7410 23.2444 2.4543 271.7226 16.0151 38.9783 182.1962 1.2318 19.3914 0.0135 7.8585 125.3386 15.2505 37.0126 63.7146 23.4486 23.1224 22.3624 6.4876 288.4405 348.5084 288.4494 6.4159 0.3523 2.5956 0.4805 4.8519 86.9914 23.1512 31.4478 18.8582 12.0233 25.7416 11.3410 95.4646 27.0279 20.6816 20.6125 0.6402 47.9950 206.2108 39.3237 17.1094 24.1399 7.2797 24.7370 4.9808 22.4616 14.0109 14.9782 30.7345 3.2213 1.5949 0.9012 3.3794
temp: 298.150 k
press: 1.00000 atm
elementType: 15 8 8 8 8 8 7 6 6 6 6 6 6 6 6 6 6 1 1 1 1 1 1 1 1 1 1 1 1 1 1
symmnumber: 1
zpe: 611502.0 jmol-1
zpe.correction: 0.232909 hartree
zpe.thermalcorrener: 0.250878 hartree
zpe.thermalcorrenthalpy: 0.251822 hartree
zpe.thermalcorrgfe: 0.184154 hartree
zpe.sumelectzpe: -1160.178607 hartree
zpe.sumelectthermal: -1160.160638 hartree
zpe.sumelectthermalent: -1160.159694 hartree
zpe.sumelectthermalfe: -1160.227362 hartree
dipole: -8.1913 1.8927 4.4503
dipole: 9.5124
quadrupole: -127.8313 -103.9325 -109.6688
quadrupole: -4.1351 -7.0017 -2.6565
quadrupole: -14.0204 9.8783 4.1421 -4.1351 -7.0017 -2.6565
hfenergy: -1160.411516 hartree
pointgroup: C01 [X(C10H14N1O5P1)]
dipole: -3.218708 -0.144579 -1.9039342 debye
polarizability: 245.6260071|-7.6244526|111.7830874|2.8892943|1.7216479|149.1911098 unknown
InChI: InChI=1S/C10H14NO5P/c1-3-15-17(14,4-2)16-10-7-5-9(6-8-10)11(12)13/h5-8H,3-4H2,1-2H3
charge 0 multiplicity 1
31 atoms
P  -2.494562 0.415365 0.545939
O  -1.153562 0.70229 -0.591349
O  -2.773567 -1.29162 0.414014
O  -2.246432 0.828459 2.057213
O  4.867036 -0.147783 1.410934
O  5.170203 0.066648 -0.840998
N  4.418466 0.030182 0.211481
C  -3.827749 1.315113 -0.404072
C  -5.213311 1.09648 0.236784
C  0.211752 0.517847 -0.313552
C  -2.824958 -1.966496 -0.918406
C  0.729937 0.330666 0.995067
C  1.067627 0.556392 -1.443489
C  -2.911388 -3.462035 -0.629257
C  2.962727 0.20106 0.030405
C  2.116939 0.167164 1.161736
C  2.45236 0.398764 -1.273843
H  -3.537532 2.379794 -0.393931
H  -3.787511 0.962987 -1.448869
H  -5.973152 1.668125 -0.323781
H  -5.50695 0.0321 0.225234
H  -5.228786 1.441384 1.28496
H  -3.715594 -1.610147 -1.474806
H  -1.914802 -1.710566 -1.492644
H  0.05908 0.328326 1.859627
H  0.630816 0.713723 -2.433537
H  -2.961349 -4.027519 -1.578218
H  -2.02515 -3.797384 -0.065487
H  -3.810691 -3.692988 -0.034119
H  2.553616 0.019918 2.152927
H  3.140689 0.423451 -2.122364
