program: Orca
programVersion: 5.0.2
elementType: S S O N N N N C C C C C C C C C C C C C C H H H H H H H H H H H H H H H H
charge: 0
multiplicity: 1
keywords: wb97x-d3
keywords: def2-TZVPP
keywords: def2/J RIJCOSX
keywords: DEFGRID2
keywords: scfconv7
keywords: smallprint printgap noloewdin
keywords: NOSOSCF
formula: C14H16N4OS2
InChI: InChI=1/C14H16N4OS2/c1-3-9-12(21-14(18-9)16-4-2)13(19)17-10(8-15)11-6-5-7-20-11/h5-7,10,16-17H,3-4H2,1-2H3
37 atoms
S  -2.640626 -0.912113 -1.215884
S  3.250407 -1.445909 1.410318
O  0.073079 -1.826945 -1.547032
N  1.177705 0.054628 -0.959343
N  -2.896144 1.150583 0.301562
N  -4.92545 0.267546 -0.464359
N  3.69208 0.575874 -3.177527
C  -1.561471 0.961759 0.149364
C  -1.204644 -0.095788 -0.651442
C  -0.645827 1.871993 0.910314
C  2.497974 -0.504866 -1.11358
C  -3.592888 0.266682 -0.372777
C  0.052654 -0.692611 -1.073193
C  3.330601 -0.3103 0.120632
C  0.026668 1.180717 2.094822
C  -5.775136 1.105545 0.361726
C  4.128995 0.746316 0.440156
C  -6.095109 0.492053 1.713272
C  4.685748 0.635303 1.741825
C  3.175768 0.093625 -2.269319
C  4.292765 -0.49872 2.382391
H  0.104533 2.318692 0.253909
H  -1.241509 2.708092 1.274711
H  2.391864 -1.568682 -1.341727
H  1.137964 0.987454 -0.578951
H  0.652584 1.887919 2.638582
H  0.660788 0.35046 1.782991
H  -0.716342 0.788315 2.78905
H  -5.370288 -0.518636 -0.912474
H  -5.29431 2.073825 0.482291
H  -6.693579 1.27882 -0.197285
H  4.316306 1.577246 -0.226642
H  -6.735639 1.163583 2.285671
H  -6.622653 -0.455608 1.59966
H  -5.190962 0.311475 2.294929
H  5.350913 1.36635 2.177462
H  4.569027 -0.835019 3.370292
elementType: S O N C H
totalener: -1633.84948715 hartree
nucrepener: 1893.71695985 hartree
electener: -3527.56644700 hartree
oneelecener: -6001.18211231 hartree
twoeener: 2473.61566531 hartree
cpcmener: -0.04481773 hartree
kineticenergy: 1628.86030039 hartree
xcener: -119.650117321776 hartree
chargesum: 0.0000000
charge: 0.015887 0.048812 -0.547908 -0.216407 -0.396618 -0.198838 -0.110026 0.090015 -0.115621 -0.109765 0.358032 0.247139 0.375254 -0.073678 -0.257464 0.017402 -0.163403 -0.256000 -0.224529 -0.214887 -0.139835 0.083658 0.083551 0.126822 0.204847 0.100431 0.058661 0.101945 0.171310 0.083028 0.099105 0.159516 0.091011 0.085772 0.082782 0.169763 0.170239
qa: 0.0159 0.0488 -0.5479 -0.2164 -0.3966 -0.1988 -0.1100 0.0900 -0.1156 -0.1098 0.3580 0.2471 0.3753 -0.0737 -0.2575 0.0174 -0.1634 -0.2560 -0.2245 -0.2149 -0.1398 0.0837 0.0836 0.1268 0.2048 0.1004 0.0587 0.1019 0.1713 0.0830 0.0991 0.1595 0.0910 0.0858 0.0828 0.1698 0.1702
va: 2.6728 2.7456 1.9647 3.2104 2.9838 3.2427 3.1107 3.9875 3.6500 3.9014 3.7181 4.1499 4.1338 3.7776 3.9238 3.8436 3.9044 3.9326 4.0023 4.0840 3.9555 1.0073 1.0265 1.0537 1.0040 1.0060 1.0220 1.0041 1.0067 1.0211 0.9983 1.0062 1.0075 1.0047 1.0073 0.9931 0.9901
dispcorr: -0.018122648 hartree
energy: -1633.867609795040
dipole: -17.57657 15.84502 -1.73155 12.63344 -11.37156 1.26188 16.90433 -14.21391 2.69042
magnitude: 3.43933 au
magnitude: 8.74207 debye
