program: Orca
programVersion: 5.0.2
elementType: S S O N N N N C C C C C C C C C C C C C C H H H H H H H H H H H H H H H H
charge: 0
multiplicity: 1
keywords: wb97x-d3
keywords: def2-TZVPP
keywords: def2/J RIJCOSX
keywords: DEFGRID2
keywords: scfconv7
keywords: smallprint printgap noloewdin
keywords: NOSOSCF
formula: C14H16N4OS2
InChI: InChI=1/C14H16N4OS2/c1-3-9-12(21-14(18-9)16-4-2)13(19)17-10(8-15)11-6-5-7-20-11/h5-7,10,16-17H,3-4H2,1-2H3
37 atoms
S  -2.143397 -1.424037 0.802216
S  3.605223 1.206228 0.718159
O  0.534406 -2.008576 0.084246
N  1.138051 -0.144806 -1.025661
N  -3.066277 0.838421 -0.004885
N  -4.590531 -0.42372 1.241727
N  3.633629 0.530315 -3.208015
C  -1.784635 0.778986 -0.444975
C  -1.098973 -0.365115 -0.113729
C  -1.269021 1.969826 -1.189288
C  2.50303 -0.602966 -1.140825
C  -3.399298 -0.237941 0.667875
C  0.238164 -0.891027 -0.336968
C  3.351296 -0.372352 0.07626
C  -0.605773 2.983316 -0.256332
C  -5.728295 0.442642 0.987608
C  4.014864 -1.314498 0.798802
C  -6.40452 0.18814 -0.347405
C  4.742005 -0.757774 1.884955
C  3.118051 0.034151 -2.307225
C  4.611721 0.593618 1.96028
H  -0.584633 1.676551 -1.985991
H  -2.115136 2.442404 -1.688526
H  2.501577 -1.677583 -1.341266
H  0.964157 0.83427 -1.193542
H  -0.251785 3.844352 -0.822919
H  0.249793 2.55475 0.268146
H  -1.309087 3.343075 0.494526
H  -4.792717 -1.32809 1.63892
H  -6.432691 0.277767 1.801082
H  -5.403041 1.479082 1.061366
H  3.988192 -2.368495 0.559829
H  -5.722562 0.353322 -1.181158
H  -6.78164 -0.832804 -0.411198
H  -7.250917 0.864646 -0.469226
H  5.333628 -1.338083 2.577432
H  5.049335 1.265035 2.683638
elementType: S O N C H
totalener: -1633.84993420 hartree
nucrepener: 1891.61174055 hartree
electener: -3525.46167476 hartree
oneelecener: -5997.46379373 hartree
twoeener: 2472.00211897 hartree
cpcmener: -0.04436777 hartree
kineticenergy: 1628.86563444 hartree
xcener: -119.649305846278 hartree
chargesum: -0.0000000
charge: 0.016787 0.044244 -0.551728 -0.224426 -0.403495 -0.203326 -0.102112 0.081491 -0.080348 -0.122317 0.309894 0.246132 0.378158 -0.017380 -0.248433 0.021587 -0.232524 -0.259654 -0.185571 -0.199961 -0.160930 0.077213 0.086171 0.142748 0.206933 0.098754 0.072358 0.092917 0.173501 0.100105 0.080412 0.166958 0.083372 0.084863 0.091322 0.167845 0.168438
qa: 0.0168 0.0442 -0.5517 -0.2244 -0.4035 -0.2033 -0.1021 0.0815 -0.0803 -0.1223 0.3099 0.2461 0.3782 -0.0174 -0.2484 0.0216 -0.2325 -0.2597 -0.1856 -0.2000 -0.1609 0.0772 0.0862 0.1427 0.2069 0.0988 0.0724 0.0929 0.1735 0.1001 0.0804 0.1670 0.0834 0.0849 0.0913 0.1678 0.1684
va: 2.6756 2.7654 1.9596 3.2274 2.9618 3.2396 3.1071 3.9792 3.6293 3.9245 3.7718 4.1558 4.1361 3.6616 3.9091 3.8429 3.9703 3.9195 3.9716 4.0597 4.0000 1.0144 1.0214 1.0258 0.9946 1.0052 1.0110 1.0074 1.0061 0.9982 1.0178 1.0003 1.0113 1.0053 1.0073 0.9924 0.9935
dispcorr: -0.017285542 hartree
energy: -1633.867219744743
dipole: -22.13737 20.09937 -2.03800 10.05950 -9.54415 0.51535 1.20095 0.35299 1.55394
magnitude: 2.61415 au
magnitude: 6.64464 debye
