program: Orca
programVersion: 5.0.2
elementType: S S O N N N N C C C C C C C C C C C C C C H H H H H H H H H H H H H H H H
charge: 0
multiplicity: 1
keywords: wb97x-d3
keywords: def2-TZVPP
keywords: def2/J RIJCOSX
keywords: DEFGRID2
keywords: scfconv7
keywords: smallprint printgap noloewdin
keywords: NOSOSCF
formula: C14H16N4OS2
InChI: InChI=1/C14H16N4OS2/c1-3-9-12(21-14(18-9)16-4-2)13(19)17-10(8-15)11-6-5-7-20-11/h5-7,10,16-17H,3-4H2,1-2H3
37 atoms
S  -2.442888 -0.195282 1.324784
S  3.594246 1.222353 -0.677048
O  0.265003 -1.046231 1.636112
N  1.033614 -0.754492 -0.463708
N  -2.939539 1.157265 -0.807363
N  -4.753188 0.99683 0.6484
N  3.286031 -2.573347 -2.198871
C  -1.642426 0.773935 -0.902306
C  -1.173527 0.018387 0.145364
C  -0.897388 1.207023 -2.125329
C  2.349723 -1.249466 -0.145325
C  -3.493044 0.721419 0.299874
C  0.089222 -0.613132 0.498044
C  3.332405 -0.191972 0.270081
C  -1.063762 0.225397 -3.284786
C  -5.453223 0.314982 1.718948
C  4.132227 -0.20653 1.37117
C  -5.929493 -1.079077 1.349164
C  4.967505 0.939658 1.455686
C  2.864753 -1.994428 -1.297933
C  4.780516 1.79632 0.415988
H  -1.288995 2.180146 -2.42367
H  0.159152 1.369578 -1.907745
H  2.268948 -1.966031 0.676742
H  0.883012 -0.38922 -1.390883
H  -2.114514 0.100701 -3.545336
H  -0.662615 -0.760665 -3.048132
H  -0.542082 0.592853 -4.168029
H  -5.318033 1.413673 -0.077949
H  -4.8069 0.283724 2.599265
H  -6.300801 0.938849 1.996738
H  4.124026 -1.010238 2.094429
H  -6.434839 -1.537152 2.199559
H  -6.635815 -1.042668 0.519505
H  -5.102707 -1.730426 1.063859
H  5.670127 1.11912 2.256196
H  5.272757 2.739823 0.234509
elementType: S O N C H
totalener: -1633.85115938 hartree
nucrepener: 1891.03042387 hartree
electener: -3524.88158324 hartree
oneelecener: -5996.05133275 hartree
twoeener: 2471.16974950 hartree
cpcmener: -0.04456083 hartree
kineticenergy: 1628.85906618 hartree
xcener: -119.648935054187 hartree
chargesum: -0.0000000
charge: 0.002284 0.041046 -0.552918 -0.230362 -0.390063 -0.204469 -0.105471 0.086275 -0.074623 -0.118645 0.311522 0.226743 0.381447 -0.003269 -0.257722 -0.012210 -0.234579 -0.234460 -0.183707 -0.194150 -0.162796 0.084133 0.071360 0.137906 0.215487 0.092404 0.083360 0.098058 0.176986 0.085937 0.102791 0.166612 0.090912 0.090173 0.076355 0.168589 0.169065
qa: 0.0023 0.0410 -0.5529 -0.2304 -0.3901 -0.2045 -0.1055 0.0863 -0.0746 -0.1186 0.3115 0.2267 0.3814 -0.0033 -0.2577 -0.0122 -0.2346 -0.2345 -0.1837 -0.1941 -0.1628 0.0841 0.0714 0.1379 0.2155 0.0924 0.0834 0.0981 0.1770 0.0859 0.1028 0.1666 0.0909 0.0902 0.0764 0.1686 0.1691
va: 2.6936 2.7689 1.9579 3.2303 3.0083 3.2012 3.1061 3.9738 3.5985 3.9278 3.7307 4.2144 4.1630 3.6800 3.9057 3.8939 3.9659 3.9139 3.9670 4.0599 4.0027 1.0232 1.0140 1.0366 0.9866 1.0082 1.0081 1.0047 1.0131 0.9999 0.9995 0.9992 1.0090 1.0040 1.0122 0.9923 0.9936
dispcorr: -0.017035452 hartree
energy: -1633.868194831345
dipole: -19.93116 18.14133 -1.78983 1.63903 -0.10889 1.53014 -2.82988 3.10555 0.27567
magnitude: 2.37083 au
magnitude: 6.02616 debye
