program: Orca
programVersion: 5.0.2
elementType: S S O N N N N C C C C C C C C C C C C C C H H H H H H H H H H H H H H H H
charge: 0
multiplicity: 1
keywords: wb97x-d3
keywords: def2-TZVPP
keywords: def2/J RIJCOSX
keywords: DEFGRID2
keywords: scfconv7
keywords: smallprint printgap noloewdin
keywords: NOSOSCF
formula: C14H16N4OS2
InChI: InChI=1/C14H16N4OS2/c1-3-9-12(21-14(18-9)16-4-2)13(19)17-10(8-15)11-6-5-7-20-11/h5-7,10,16-17H,3-4H2,1-2H3
37 atoms
S  -1.97782 1.184716 0.155387
S  2.931249 0.249881 -2.016768
O  1.02908 -1.277054 0.858837
N  1.039796 0.909732 0.37881
N  -3.184864 -1.079994 -0.034885
N  -4.582406 0.778634 -0.271166
N  3.046999 0.422318 3.099775
C  -1.878511 -1.369309 0.16854
C  -1.03875 -0.285852 0.294797
C  -1.491366 -2.809847 0.254753
C  2.454923 1.01503 0.619358
C  -3.395538 0.213561 -0.071016
C  0.394942 -0.278747 0.528184
C  3.301706 0.21733 -0.3364
C  -1.538753 -3.326449 1.691461
C  -4.814776 2.20657 -0.192186
C  4.410791 -0.528682 -0.086432
C  -6.213818 2.548225 -0.655411
C  4.97159 -1.086189 -1.268591
C  2.781571 0.659733 2.006056
C  4.275452 -0.748853 -2.385656
H  -2.188641 -3.382647 -0.357763
H  -0.498263 -2.966031 -0.161022
H  2.7025 2.075698 0.516969
H  0.571616 1.752515 0.0880
H  -0.840638 -2.788605 2.331935
H  -1.273894 -4.383138 1.722083
H  -2.535844 -3.221199 2.118679
H  -5.380165 0.159061 -0.290609
H  -4.663013 2.560967 0.832163
H  -4.086661 2.723146 -0.823982
H  4.818234 -0.685674 0.90284
H  -6.966595 2.053392 -0.041591
H  -6.373521 3.621825 -0.576852
H  -6.370631 2.259101 -1.693759
H  5.848326 -1.7172 -1.278986
H  4.471035 -1.039347 -3.406742
elementType: S O N C H
totalener: -1633.85177158 hartree
nucrepener: 1898.54565774 hartree
electener: -3532.39742932 hartree
oneelecener: -6012.10043467 hartree
twoeener: 2479.70300535 hartree
cpcmener: -0.05137335 hartree
kineticenergy: 1628.87205872 hartree
xcener: -119.654057124407 hartree
chargesum: -0.0000000
charge: -0.038212 0.044244 -0.553793 -0.224574 -0.385509 -0.173389 -0.100508 0.100202 -0.100374 -0.103126 0.459081 0.226558 0.432937 -0.079234 -0.268672 -0.011645 -0.229202 -0.270000 -0.184572 -0.252825 -0.184622 0.080156 0.076771 0.153500 0.179052 0.083791 0.096195 0.088313 0.175680 0.107902 0.094964 0.149681 0.091294 0.090541 0.093338 0.168704 0.167350
qa: -0.0382 0.0442 -0.5538 -0.2246 -0.3855 -0.1734 -0.1005 0.1002 -0.1004 -0.1031 0.4591 0.2266 0.4329 -0.0792 -0.2687 -0.0116 -0.2292 -0.2700 -0.1846 -0.2528 -0.1846 0.0802 0.0768 0.1535 0.1791 0.0838 0.0962 0.0883 0.1757 0.1079 0.0950 0.1497 0.0913 0.0905 0.0933 0.1687 0.1674
va: 2.6428 2.7654 1.9431 3.2047 3.0181 3.2051 3.1055 3.9590 3.6868 3.8715 3.7546 4.2389 4.0314 3.7945 3.9108 3.8505 3.9473 3.9669 3.9663 4.1015 4.0051 1.0223 1.0276 0.9912 1.0138 1.0132 1.0035 1.0059 1.0148 0.9919 0.9902 1.0137 0.9993 1.0051 1.0027 0.9923 0.9938
dispcorr: -0.016518522 hartree
energy: -1633.868290098409
dipole: -21.35335 18.93851 -2.41484 -2.57161 5.45034 2.87873 -0.27043 -2.03047 -2.30090
magnitude: 4.40598 au
magnitude: 11.19912 debye
