program: Orca
programVersion: 5.0.2
elementType: S S O N N N N C C C C C C C C C C C C C C H H H H H H H H H H H H H H H H
charge: 0
multiplicity: 1
keywords: wb97x-d3
keywords: def2-TZVPP
keywords: def2/J RIJCOSX
keywords: DEFGRID2
keywords: scfconv7
keywords: smallprint printgap noloewdin
keywords: NOSOSCF
formula: C14H16N4OS2
InChI: InChI=1/C14H16N4OS2/c1-3-9-12(21-14(18-9)16-4-2)13(19)17-10(8-15)11-6-5-7-20-11/h5-7,10,16-17H,3-4H2,1-2H3
37 atoms
S  -2.43521 -0.268177 1.288761
S  2.705374 1.551837 -0.010872
O  0.255664 -1.005592 1.741401
N  1.116192 -0.927898 -0.343317
N  -3.127782 0.040174 -1.17162
N  -4.876997 0.320789 0.341604
N  3.493367 -3.042291 -1.479938
C  -1.81156 -0.277334 -1.19302
C  -1.233551 -0.480815 0.038742
C  -1.149863 -0.334684 -2.53377
C  2.449741 -1.234376 0.097634
C  -3.596858 0.07891 0.055469
C  0.086725 -0.821574 0.53757
C  3.355475 -0.029432 0.157609
C  -0.547358 1.010615 -2.937653
C  -5.371442 0.578074 1.67931
C  4.69852 0.002287 0.378139
C  -5.08436 1.982594 2.182271
C  5.212001 1.326359 0.406012
C  3.032618 -2.248365 -0.786394
C  4.246231 2.264679 0.208666
H  -0.395012 -1.121233 -2.570638
H  -1.905815 -0.620646 -3.265231
H  2.38321 -1.684393 1.092044
H  0.99765 -0.669634 -1.310579
H  0.234716 1.333571 -2.249676
H  -1.309378 1.789235 -2.958694
H  -0.108036 0.94475 -3.932587
H  -5.446191 0.630538 -0.432907
H  -6.444739 0.399563 1.66284
H  -4.956084 -0.169582 2.35947
H  5.301902 -0.885043 0.515823
H  -5.483298 2.10464 3.189339
H  -4.014879 2.192348 2.221348
H  -5.554156 2.729416 1.542145
H  6.253489 1.566129 0.564924
H  4.357201 3.338112 0.178303
elementType: S O N C H
totalener: -1633.85033159 hartree
nucrepener: 1903.81421564 hartree
electener: -3537.66454723 hartree
oneelecener: -6021.51124414 hartree
twoeener: 2483.84669692 hartree
cpcmener: -0.04380521 hartree
kineticenergy: 1628.85668488 hartree
xcener: -119.652184213308 hartree
chargesum: -0.0000000
charge: 0.003466 0.049580 -0.543657 -0.266124 -0.387560 -0.199662 -0.109206 0.087047 -0.087922 -0.119802 0.384272 0.230567 0.383285 0.013727 -0.249170 -0.013611 -0.293192 -0.233872 -0.168802 -0.196862 -0.185050 0.076298 0.084548 0.135508 0.213156 0.073100 0.093064 0.098830 0.178080 0.103185 0.086472 0.167882 0.091600 0.075993 0.089768 0.169078 0.165986
qa: 0.0035 0.0496 -0.5437 -0.2661 -0.3876 -0.1997 -0.1092 0.0870 -0.0879 -0.1198 0.3843 0.2306 0.3833 0.0137 -0.2492 -0.0136 -0.2932 -0.2339 -0.1688 -0.1969 -0.1851 0.0763 0.0845 0.1355 0.2132 0.0731 0.0931 0.0988 0.1781 0.1032 0.0865 0.1679 0.0916 0.0760 0.0898 0.1691 0.1660
va: 2.6941 2.7968 1.9695 3.2067 3.0083 3.2051 3.1064 3.9820 3.6025 3.9203 3.6358 4.2094 4.1438 3.7754 3.9149 3.8879 4.0057 3.9122 3.9528 4.0368 4.0071 1.0121 1.0230 1.0364 0.9953 1.0067 1.0077 1.0058 1.0127 0.9991 1.0005 1.0024 1.0087 1.0125 1.0044 0.9917 0.9957
dispcorr: -0.017288585 hartree
energy: -1633.867620176868
dipole: -15.13896 13.39327 -1.74569 10.68292 -8.53357 2.14935 -3.57088 3.28765 -0.28323
magnitude: 2.78341 au
magnitude: 7.07486 debye
