program: Orca
programVersion: 5.0.2
elementType: S S O N N N N C C C C C C C C C C C C C C H H H H H H H H H H H H H H H H
charge: 0
multiplicity: 1
keywords: wb97x-d3
keywords: def2-TZVPP
keywords: def2/J RIJCOSX
keywords: DEFGRID2
keywords: scfconv7
keywords: smallprint printgap noloewdin
keywords: NOSOSCF
formula: C14H16N4OS2
InChI: InChI=1/C14H16N4OS2/c1-3-9-12(21-14(18-9)16-4-2)13(19)17-10(8-15)11-6-5-7-20-11/h5-7,10,16-17H,3-4H2,1-2H3
37 atoms
S  -2.03422 1.176934 0.664452
S  3.052295 -0.878094 -1.265991
O  0.872059 -1.513004 0.584927
N  0.965891 0.692895 0.912945
N  -3.354198 -0.942392 0.052994
N  -4.685906 0.954772 0.31463
N  3.223977 -1.050038 2.845629
C  -2.061203 -1.327724 0.156769
C  -1.166679 -0.331683 0.479427
C  -1.738602 -2.75912 -0.13007
C  2.401462 0.661395 1.043732
C  -3.504794 0.336913 0.295052
C  0.26999 -0.442023 0.65242
C  3.172627 0.498672 -0.235165
C  -1.241298 -2.958619 -1.56073
C  -4.846507 2.395809 0.32585
C  4.061972 1.406458 -0.728232
C  -4.65208 3.040672 -1.035684
C  4.649851 0.99575 -1.952893
C  2.825876 -0.328433 2.04223
C  4.190608 -0.217937 -2.360983
H  -0.999337 -3.133242 0.574348
H  -2.647441 -3.342325 0.018895
H  2.694164 1.629786 1.457133
H  0.55019 1.610711 0.883252
H  -1.040186 -4.013762 -1.746321
H  -0.321259 -2.406165 -1.749506
H  -1.984293 -2.629297 -2.287374
H  -5.463953 0.407677 -0.026183
H  -5.847236 2.60297 0.700413
H  -4.16051 2.823166 1.061152
H  4.287873 2.337897 -0.227194
H  -5.378776 2.659389 -1.753672
H  -4.790103 4.119166 -0.959114
H  -3.652693 2.859596 -1.43335
H  5.373939 1.579827 -2.501743
H  4.463256 -0.760726 -3.253813
elementType: S O N C H
totalener: -1633.85062460 hartree
nucrepener: 1918.56941966 hartree
electener: -3552.42004426 hartree
oneelecener: -6052.16949005 hartree
twoeener: 2499.74944579 hartree
cpcmener: -0.05192217 hartree
kineticenergy: 1628.87764754 hartree
xcener: -119.655433061236 hartree
chargesum: -0.0000000
charge: -0.036996 0.061180 -0.553107 -0.195320 -0.379080 -0.199833 -0.114296 0.095970 -0.107982 -0.098052 0.415100 0.231012 0.450440 -0.081623 -0.263745 -0.013261 -0.254073 -0.233727 -0.190158 -0.220241 -0.169792 0.078104 0.079974 0.143580 0.167807 0.096072 0.074996 0.091270 0.180211 0.104356 0.085864 0.164024 0.090195 0.092162 0.077888 0.167086 0.163997
qa: -0.0370 0.0612 -0.5531 -0.1953 -0.3791 -0.1998 -0.1143 0.0960 -0.1080 -0.0981 0.4151 0.2310 0.4504 -0.0816 -0.2637 -0.0133 -0.2541 -0.2337 -0.1902 -0.2202 -0.1698 0.0781 0.0800 0.1436 0.1678 0.0961 0.0750 0.0913 0.1802 0.1044 0.0859 0.1640 0.0902 0.0922 0.0779 0.1671 0.1640
va: 2.6373 2.8051 1.9393 3.2143 3.0227 3.2186 3.1123 3.9704 3.7185 3.8548 3.7480 4.2264 4.0303 3.7028 3.9246 3.8955 3.9859 3.9166 3.9621 4.0816 4.0096 1.0298 1.0244 1.0062 1.0207 1.0039 1.0110 1.0039 1.0115 0.9988 1.0000 1.0003 1.0041 1.0087 1.0103 0.9931 0.9958
dispcorr: -0.016935986 hartree
energy: -1633.867560583844
dipole: -17.87609 15.41781 -2.45828 5.98532 -1.67314 4.31217 -10.51806 8.86345 -1.65461
magnitude: 5.23218 au
magnitude: 13.29914 debye
