program: Orca
programVersion: 5.0.2
elementType: S S O N N N N C C C C C C C C C C C C C C H H H H H H H H H H H H H H H H
charge: 0
multiplicity: 1
keywords: wb97x-d3
keywords: def2-TZVPP
keywords: def2/J RIJCOSX
keywords: DEFGRID2
keywords: scfconv7
keywords: smallprint printgap noloewdin
keywords: NOSOSCF
formula: C14H16N4OS2
InChI: InChI=1/C14H16N4OS2/c1-3-9-12(21-14(18-9)16-4-2)13(19)17-10(8-15)11-6-5-7-20-11/h5-7,10,16-17H,3-4H2,1-2H3
37 atoms
S  -2.032443 1.193128 -0.443263
S  3.146515 -1.435405 -0.350366
O  0.866498 -0.804411 1.370671
N  0.937517 1.099546 0.206376
N  -3.300104 -0.918195 0.291277
N  -4.613388 0.60375 -0.889872
N  3.128665 1.106174 2.874997
C  -2.024672 -1.087466 0.710087
C  -1.156879 -0.061917 0.407619
C  -1.689248 -2.368498 1.403858
C  2.365623 1.21057 0.373495
C  -3.461926 0.220335 -0.338068
C  0.262232 0.030618 0.698954
C  3.199459 0.283798 -0.465925
C  -1.073742 -3.391141 0.450166
C  -4.878969 1.950334 -1.356628
C  4.102852 0.686455 -1.404098
C  -5.197917 2.930407 -0.241008
C  4.758203 -0.398289 -2.04258
C  2.753566 1.120476 1.786744
C  4.337768 -1.602182 -1.568576
H  -1.017802 -2.188433 2.240657
H  -2.613217 -2.77388 1.816911
H  2.631917 2.225201 0.067381
H  0.526039 1.751406 -0.442957
H  -0.138337 -3.032177 0.022077
H  -1.751199 -3.622486 -0.371782
H  -0.863079 -4.320586 0.979129
H  -5.411627 0.02982 -0.656957
H  -4.02627 2.294952 -1.946318
H  -5.714035 1.88874 -2.051726
H  4.292186 1.727996 -1.625595
H  -6.094856 2.625858 0.298462
H  -4.380639 3.011541 0.476262
H  -5.376592 3.92186 -0.656967
H  5.503374 -0.2844 -2.816293
H  4.661703 -2.584063 -1.88048
elementType: S O N C H
totalener: -1633.85071772 hartree
nucrepener: 1917.34555718 hartree
electener: -3551.19627489 hartree
oneelecener: -6049.73326220 hartree
twoeener: 2498.53698730 hartree
cpcmener: -0.05185260 hartree
kineticenergy: 1628.87670895 hartree
xcener: -119.655124565674 hartree
chargesum: 0.0000000
charge: -0.036840 0.062241 -0.552787 -0.196304 -0.379662 -0.199159 -0.113532 0.096293 -0.102643 -0.100993 0.412641 0.231797 0.446577 -0.082877 -0.262232 -0.012529 -0.251896 -0.234436 -0.191055 -0.219576 -0.168412 0.078470 0.080146 0.142217 0.168033 0.074090 0.091709 0.095993 0.179764 0.086237 0.104316 0.163571 0.090949 0.077295 0.091906 0.167241 0.163447
qa: -0.0368 0.0622 -0.5528 -0.1963 -0.3797 -0.1992 -0.1135 0.0963 -0.1026 -0.1010 0.4126 0.2318 0.4466 -0.0829 -0.2622 -0.0125 -0.2519 -0.2344 -0.1911 -0.2196 -0.1684 0.0785 0.0801 0.1422 0.1680 0.0741 0.0917 0.0960 0.1798 0.0862 0.1043 0.1636 0.0909 0.0773 0.0919 0.1672 0.1634
va: 2.6383 2.8045 1.9405 3.2079 3.0213 3.2175 3.1116 3.9695 3.7119 3.8569 3.7504 4.2250 4.0346 3.7074 3.9255 3.8922 3.9855 3.9171 3.9629 4.0792 4.0096 1.0292 1.0245 1.0072 1.0210 1.0108 1.0041 1.0043 1.0117 1.0003 0.9990 1.0003 1.0037 1.0106 1.0087 0.9930 0.9959
dispcorr: -0.016964295 hartree
energy: -1633.867682011733
dipole: -18.74699 16.26496 -2.48203 0.59761 1.72561 2.32322 -6.34899 2.57719 -3.77180
magnitude: 5.07782 au
magnitude: 12.90679 debye
