program: Orca
programVersion: 5.0.2
elementType: S S O N N N N C C C C C C C C C C C C C C H H H H H H H H H H H H H H H H
charge: 0
multiplicity: 1
keywords: wb97x-d3
keywords: def2-TZVPP
keywords: def2/J RIJCOSX
keywords: DEFGRID2
keywords: scfconv7
keywords: smallprint printgap noloewdin
keywords: NOSOSCF
formula: C14H16N4OS2
InChI: InChI=1/C14H16N4OS2/c1-3-9-12(21-14(18-9)16-4-2)13(19)17-10(8-15)11-6-5-7-20-11/h5-7,10,16-17H,3-4H2,1-2H3
37 atoms
S  -2.102593 0.869932 -0.701627
S  2.682029 -1.39406 -1.464673
O  1.033566 -0.002886 1.542507
N  0.933571 0.965868 -0.470223
N  -3.201823 -0.625892 1.075198
N  -4.698853 0.216384 -0.50177
N  3.109376 2.823236 1.414582
C  -1.882249 -0.603264 1.374179
C  -1.093153 0.146352 0.532167
C  -1.418987 -1.435004 2.527758
C  2.353875 1.193635 -0.488754
C  -3.477792 0.091254 0.015447
C  0.345282 0.35027 0.59434
C  3.170803 -0.071826 -0.476352
C  -0.863002 -2.781758 2.067918
C  -5.05333 1.122241 -1.573852
C  4.328831 -0.343946 0.181884
C  -5.278414 2.55468 -1.116349
C  4.833497 -1.64037 -0.115077
C  2.770156 2.085757 0.602255
C  4.046251 -2.318838 -0.990163
H  -0.66717 -0.904047 3.107644
H  -2.275919 -1.601546 3.181766
H  2.561623 1.741719 -1.413072
H  0.416688 1.298778 -1.268398
H  -1.610872 -3.349115 1.512647
H  -0.562318 -3.381135 2.927782
H  0.009848 -2.658594 1.426733
H  -5.445597 -0.193512 0.040547
H  -4.279742 1.080175 -2.345471
H  -5.957045 0.730574 -2.03794
H  4.808841 0.345672 0.863214
H  -4.382108 2.986189 -0.669017
H  -5.556918 3.177918 -1.966842
H  -6.083275 2.608592 -0.382764
H  5.736964 -2.047635 0.31601
H  4.185111 -3.318314 -1.37453
elementType: S O N C H
totalener: -1633.85476256 hartree
nucrepener: 1918.42479416 hartree
electener: -3552.27955672 hartree
oneelecener: -6051.73993826 hartree
twoeener: 2499.46038154 hartree
cpcmener: -0.04256079 hartree
kineticenergy: 1628.87110484 hartree
xcener: -119.651961088358 hartree
chargesum: -0.0000000
charge: -0.046480 0.040001 -0.511548 -0.223207 -0.375799 -0.196713 -0.087135 0.095266 -0.076657 -0.103513 0.437379 0.235887 0.389109 -0.068022 -0.264625 -0.018683 -0.224727 -0.228662 -0.180431 -0.254801 -0.182610 0.082604 0.079543 0.149276 0.172557 0.089825 0.094676 0.079881 0.177982 0.084764 0.103125 0.148230 0.076661 0.090592 0.088313 0.164480 0.163459
qa: -0.0465 0.0400 -0.5115 -0.2232 -0.3758 -0.1967 -0.0871 0.0953 -0.0767 -0.1035 0.4374 0.2359 0.3891 -0.0680 -0.2646 -0.0187 -0.2247 -0.2287 -0.1804 -0.2548 -0.1826 0.0826 0.0795 0.1493 0.1726 0.0898 0.0947 0.0799 0.1780 0.0848 0.1031 0.1482 0.0767 0.0906 0.0883 0.1645 0.1635
va: 2.6334 2.7593 1.9958 3.1768 3.0267 3.2099 3.1104 3.9703 3.6445 3.8556 3.7887 4.2205 4.0904 3.7787 3.9278 3.8899 3.9594 3.9129 3.9693 4.0920 4.0001 1.0290 1.0241 0.9903 1.0174 1.0029 1.0048 1.0107 1.0138 1.0014 0.9983 1.0137 1.0115 1.0090 1.0049 0.9938 0.9948
dispcorr: -0.017288618 hartree
energy: -1633.872051176335
dipole: -17.72075 15.19838 -2.52237 -3.56952 3.39647 -0.17305 1.14139 -4.43650 -3.29511
magnitude: 4.15332 au
magnitude: 10.55689 debye
