program: Gaussian 09
title: 000066045
version: EM64L-G09RevD.01
frameworkgroup: C1[X(C9H14O5)]
method: RPBEPBE
basis: SDD
operation: Freq
keyword: #pfreq=noraman
keyword: PBEPBE/SDD
title: #p freq=noraman PBEPBE/SDD
converged: YES YES NO NO
title: Mulliken charges:
elementType: O O O O O C C C C C C C C C H H H H H H H H H H H H H H
charge: -0.250739 -0.260334 -0.174859 -0.247279 -0.229147 -0.594151 -0.604674 0.223681 0.281598 0.276523 -0.231735 -0.220503 -0.669688 -0.674675 0.281188 0.245981 0.305484 0.255158 0.231537 0.237192 0.236639 0.228086 0.214921 0.236198 0.230611 0.211777 0.227423 0.233787
chargesum: 0.00000
title: Mulliken charges with hydrogens summed into heavy atoms:
elementType: O O O O O C C C C C C C C C
charge: -0.250739 -0.260334 -0.174859 -0.247279 -0.229147 -0.066983 -0.044031 0.223681 0.281598 0.276523 0.236993 0.244222 0.012043 -0.001688
polarizability: 1.55906160e+02 -5.41046346e+00 9.79325904e+01 -1.75812880e+00 -1.67027498e+00 9.40082750e+01
1716.lowfreq: -19.9593 -8.5521 -3.0785 -0.0006 0.0002 0.0009 4.2414 15.9322 28.8481
frequency: -13.0168 15.8827 28.1874 49.8942 54.8167 62.0208 96.4488 108.3520 150.4178 169.5887 186.4235 193.7918 252.7869 258.4114 291.9074 341.1037 355.1450 395.7269 403.0534 471.5454 507.1355 577.9365 599.4128 694.8357 739.4466 786.2207 797.8071 799.7824 803.8524 837.7601 883.5644 928.4424 939.0874 965.6833 1018.4363 1027.5000 1065.7298 1111.7485 1114.4931 1118.8521 1131.8664 1135.1954 1136.2588 1205.6594 1247.4844 1250.2569 1250.3687 1280.2684 1308.9889 1356.4427 1357.8005 1400.8857 1401.4032 1425.7290 1433.7974 1463.2733 1463.9880 1472.6481 1474.1638 1485.5248 1486.2835 1619.5628 1638.7941 1658.2643 2996.0105 2998.4161 3002.4814 3012.7009 3013.2464 3015.0774 3064.7925 3071.6881 3075.1253 3092.4850 3095.3250 3108.3243 3111.4028 3125.2432
redmass: 3.5310 4.0624 3.3530 3.6469 4.8243 3.8445 3.7436 4.3166 3.6186 2.6500 2.6017 3.1413 1.3597 1.4369 5.7074 3.5674 3.4103 2.2681 2.4272 5.1309 5.0826 5.7125 4.2086 5.9032 5.2020 3.2991 1.1178 1.1223 3.3149 4.0009 3.3653 4.3655 3.2372 2.6126 2.2658 2.5334 2.0740 2.1439 2.2557 1.9498 2.6632 1.5391 1.4929 1.7250 1.6538 1.1895 1.1381 1.5020 1.7245 1.4091 1.3912 1.2648 1.2601 1.1171 1.0991 1.0400 1.0402 1.0645 1.0626 1.0657 1.0670 9.6588 8.9312 10.0185 1.0358 1.0359 1.0599 1.0584 1.0631 1.0581 1.1002 1.1064 1.1067 1.0984 1.0985 1.1028 1.1030 1.0984
irintensity: 1.2183 1.2863 0.3628 2.1846 1.4959 2.6464 0.9782 0.8980 3.8498 8.5109 2.3091 11.0448 1.0388 1.6144 5.7284 17.9597 2.5916 2.6441 0.4335 7.3358 14.2878 5.2000 22.2565 2.4735 3.2690 9.7466 3.3828 4.5891 2.7400 1.0811 31.1955 29.1410 33.3467 8.3870 103.0729 75.0699 46.7595 90.9303 9.6069 152.0352 424.7405 22.2785 16.4882 27.3083 162.1997 32.9062 1.5080 191.5004 99.7349 3.4248 4.5669 22.0637 22.2617 36.5425 31.8626 12.5302 12.1764 4.6028 3.2485 15.3064 14.3306 254.7599 111.1292 149.6986 21.8484 18.6726 3.9804 16.0052 3.5822 15.3521 10.3618 5.5227 5.8254 30.0598 25.9423 43.1996 40.4955 1.6836
temp: 298.150 k
press: 1.00000 atm
elementType: 8 8 8 8 8 6 6 6 6 6 6 6 6 6 1 1 1 1 1 1 1 1 1 1 1 1 1 1
symmnumber: 1
zpe: 580610.3 jmol-1
zpe.correction: 0.221143 hartree
zpe.thermalcorrener: 0.236824 hartree
zpe.thermalcorrenthalpy: 0.237769 hartree
zpe.thermalcorrgfe: 0.175002 hartree
zpe.sumelectzpe: -726.375579 hartree
zpe.sumelectthermal: -726.359897 hartree
zpe.sumelectthermalent: -726.358953 hartree
zpe.sumelectthermalfe: -726.421720 hartree
dipole: 1.4578 1.1909 2.1054
dipole: 2.8242
quadrupole: -53.7204 -89.3537 -84.6988
quadrupole: -1.5422 -3.2463 3.5602
quadrupole: 22.2039 -13.4294 -8.7745 -1.5422 -3.2463 3.5602
hfenergy: -726.5967216 hartree
pointgroup: C01 [X(C9H14O5)]
dipole: 0.5395608 -0.884169 -0.402095 debye
polarizability: 156.1543605|3.3183423|94.699695|-2.4854341|-2.3618141|96.9929697 unknown
InChI: InChI=1S/C9H14O5/c1-3-13-8(11)5-7(10)6-9(12)14-4-2/h3-6H2,1-2H3
charge 0 multiplicity 1
28 atoms
O  3.337166 -0.804357 0.218041
O  -3.291761 -0.42815 -0.250964
O  -0.522002 -0.92169 1.591686
O  2.044495 -0.249785 -1.640138
O  -2.045147 1.543393 -0.204598
C  1.164509 -1.807396 0.072586
C  -0.969092 -0.592933 -0.802823
C  -0.155776 -1.076877 0.404411
C  2.194469 -0.876824 -0.563642
C  -2.11991 0.310695 -0.398707
C  4.428065 0.09821 -0.285436
C  -4.4868 0.33242 0.234078
C  5.574783 -0.004708 0.712957
C  -5.639269 -0.662385 0.315692
H  1.56955 -2.243892 0.996714
H  0.949353 -2.610242 -0.658347
H  -0.286383 -0.064869 -1.494122
H  -1.353056 -1.485359 -1.332094
H  4.709565 -0.237156 -1.29971
H  4.015381 1.120154 -0.359425
H  -4.233645 0.772989 1.214947
H  -4.683571 1.156754 -0.475118
H  6.405956 0.649254 0.392186
H  5.251785 0.31308 1.718646
H  5.952274 -1.03932 0.777673
H  -6.549335 -0.150241 0.677905
H  -5.857107 -1.098101 -0.674483
H  -5.401796 -1.482962 1.013886
