program: Orca
programVersion: 5.0.2
elementType: S S O N N N N C C C C C C C C C C C C C C H H H H H H H H H H H H H H H H
charge: 0
multiplicity: 1
keywords: wb97x-d3
keywords: def2-TZVPP
keywords: def2/J RIJCOSX
keywords: DEFGRID2
keywords: scfconv7
keywords: smallprint printgap noloewdin
keywords: NOSOSCF
formula: C14H16N4OS2
InChI: InChI=1/C14H16N4OS2/c1-3-9-12(21-14(18-9)16-4-2)13(19)17-10(8-15)11-6-5-7-20-11/h5-7,10,16-17H,3-4H2,1-2H3
37 atoms
S  -1.764729 0.876611 -0.034816
S  2.795147 0.547489 1.646536
O  0.531214 -2.330269 -0.374116
N  1.030959 -0.150005 -0.645197
N  -3.411098 -0.98349 0.624296
N  -4.332137 1.154588 0.701141
N  2.979941 0.389736 -3.371163
C  -2.238528 -1.60403 0.361883
C  -1.201468 -0.781945 -0.02057
C  -2.214735 -3.095164 0.478409
C  2.412207 -0.406732 -0.943958
C  -3.326729 0.313891 0.47095
C  0.159748 -1.164399 -0.357024
C  3.346214 0.236557 0.047735
C  -2.485455 -3.773525 -0.862858
C  -4.304229 2.576244 0.430259
C  4.658001 0.565035 -0.101335
C  -4.571695 2.927091 -1.023558
C  5.229295 1.073813 1.096225
C  2.737707 0.036172 -2.305487
C  4.337642 1.118299 2.121244
H  -1.264422 -3.436509 0.882416
H  -2.991028 -3.38165 1.189377
H  2.552059 -1.492038 -0.925699
H  0.742164 0.817328 -0.65529
H  -1.716108 -3.533527 -1.596224
H  -3.448594 -3.46858 -1.273584
H  -2.504374 -4.85711 -0.742438
H  -5.219516 0.724911 0.919255
H  -5.05468 3.036914 1.070718
H  -3.34314 2.982201 0.75653
H  5.203854 0.450059 -1.027898
H  -4.54029 4.008938 -1.156141
H  -3.830301 2.490007 -1.69338
H  -5.557018 2.580091 -1.335283
H  6.256692 1.39643 1.183517
H  4.500305 1.468214 3.129754
elementType: S O N C H
totalener: -1633.85549567 hartree
nucrepener: 1890.06313901 hartree
electener: -3523.91863468 hartree
oneelecener: -5994.06350910 hartree
twoeener: 2470.14487442 hartree
cpcmener: -0.03433440 hartree
kineticenergy: 1628.87272692 hartree
xcener: -119.652177677584 hartree
chargesum: -0.0000000
charge: -0.046715 0.051695 -0.517173 -0.238475 -0.376762 -0.193796 -0.096576 0.095788 -0.101890 -0.100640 0.369074 0.239365 0.427754 -0.001479 -0.271318 -0.021038 -0.270119 -0.229524 -0.169363 -0.215575 -0.180604 0.078624 0.079890 0.136470 0.172788 0.085983 0.088881 0.094721 0.177801 0.103475 0.086331 0.158691 0.090572 0.077368 0.088029 0.165549 0.162200
qa: -0.0467 0.0517 -0.5172 -0.2385 -0.3768 -0.1938 -0.0966 0.0958 -0.1019 -0.1006 0.3691 0.2394 0.4278 -0.0015 -0.2713 -0.0210 -0.2701 -0.2295 -0.1694 -0.2156 -0.1806 0.0786 0.0799 0.1365 0.1728 0.0860 0.0889 0.0947 0.1778 0.1035 0.0863 0.1587 0.0906 0.0774 0.0880 0.1655 0.1622
va: 2.6290 2.7935 2.0026 3.1960 3.0217 3.2132 3.1100 3.9591 3.6433 3.8662 3.6549 4.2219 4.0754 3.8192 3.9195 3.8866 3.9952 3.9100 3.9647 4.0622 4.0099 1.0283 1.0229 1.0429 1.0226 1.0100 1.0044 1.0039 1.0141 0.9980 1.0015 1.0076 1.0092 1.0118 1.0051 0.9929 0.9962
dispcorr: -0.016412242 hartree
energy: -1633.871907916353
dipole: -18.97739 17.34771 -1.62967 0.18643 2.17391 2.36034 -1.23482 2.91137 1.67655
magnitude: 3.32233 au
magnitude: 8.44469 debye
